[svn.haxx.se] · SVN Dev · SVN Users · SVN Org · TSVN Dev · TSVN Users · Subclipse Dev · Subclipse Users · this month's index

Re: 1.7.1 up for testing / signing

From: Stefan Sperling <stsp_at_elego.de>
Date: Fri, 21 Oct 2011 10:51:53 +0200

On Thu, Oct 20, 2011 at 04:19:08PM -0700, rupert.thurner wrote:
> on solaris, one test is failing for 1.7.0 ...
> At least one test FAILED, checking /home/rupert/mgar-sav/pkg/
> subversion/trunk/work/solaris9-sparc/build-isa-sparcv8/
> subversion-1.7.0/tests.log
> FAIL: copy_tests.py 86: changed dir after commit should match
> checkout
> Summary of test results:
> 1552 tests PASSED
> 42 tests SKIPPED
> 23 tests XFAILED (1 WORK-IN-PROGRESS)
> 1 test FAILED
> gmake: *** [check] Error 1

Please show the output of:

$ cd /home/rupert/mgar-sav/pkg/subversion/trunk/work/solaris9-sparc/build-isa-sparcv8/subversion-1.7.0/subversion/tests/cmdline
$ ./copy_tests.py 86 --verbose
Received on 2011-10-21 10:52:30 CEST

This is an archived mail posted to the Subversion Dev mailing list.