[svn.haxx.se] · SVN Dev · SVN Users · SVN Org · TSVN Dev · TSVN Users · Subclipse Dev · Subclipse Users · this month's index

Re: svn trunk r29090: FAIL (i686-debian-sarge1 shared gcc-3.3.5)

From: Paul Burba <ptburba_at_gmail.com>
Date: Thu, 31 Jan 2008 09:22:36 -0500

On Jan 30, 2008 8:52 PM, <buildbot_at_mobsol.be> wrote:
> Full details are available at:
> http://www.mobsol.be/buildbot/i686-debian-sarge1%2520shared%2520gcc-3.3.5/builds/121
>
> Author list: pburba
>
> Build Slave: eh-debsarge1
>
>
> Subversion Buildbot
> http://www.mobsol.be/buildbot/
>
>
> Last 100 lines of the build log (step: Test fsfs+ra_svn ):
>
> + test -z fsfs
> + case "$2" in
> + check=svnserveautocheck
> + echo '========= mount RAM disc'
> ========= mount RAM disc
> + mkdir -p subversion/tests/cmdline/svn-test-work
> + test -e ../mount-ramdrive
> + ../mount-ramdrive
> + echo '========= make check'
> ========= make check
> + SVN_I_LOVE_CORRUPTED_WORKING_COPIES_SO_DISABLE_SLEEP_FOR_TIMESTAMPS=yes
> + make svnserveautocheck FS_TYPE=fsfs CLEANUP=1
> bash ./subversion/tests/cmdline/svnserveautocheck.sh
> make[1]: Entering directory `/www/erik/buildslave/eh-debsarge1/build'
> Running all tests in client-test [1/56]...success
> Running all tests in compat-test [2/56]...success
> Running all tests in config-test [3/56]...success
> Running all tests in diff-diff3-test [4/56]...success
> Running all tests in error-test [5/56]...success
> Running all tests in fs-test [6/56]...success
> Running all tests in hashdump-test [7/56]...success
> Running all tests in locks-test [8/56]...success
> Running all tests in mergeinfo-test [9/56]...success
> Running all tests in opt-test [10/56]...success
> Running all tests in path-test [11/56]...success
> Running all tests in ra-local-test [12/56]...success
> Running all tests in random-test [13/56]...success
> Running all tests in repos-test [14/56]...success
> Running all tests in revision-test [15/56]...success
> Running all tests in stream-test [16/56]...success
> Running all tests in string-test [17/56]...success
> Running all tests in time-test [18/56]...success
> Running all tests in translate-test [19/56]...success
> Running all tests in utf-test [20/56]...success
> Running all tests in target-test.py [21/56]...success
> Running all tests in getopt_tests.py [22/56]...success
> Running all tests in basic_tests.py [23/56]...success
> Running all tests in checkout_tests.py [24/56]...success
> Running all tests in commit_tests.py [25/56]...success
> Running all tests in update_tests.py [26/56]...success
> Running all tests in switch_tests.py [27/56]...success
> Running all tests in prop_tests.py [28/56]...success
> Running all tests in schedule_tests.py [29/56]...success
> Running all tests in log_tests.py [30/56]...success
> Running all tests in copy_tests.py [31/56]...success
> Running all tests in diff_tests.py [32/56]...success
> Running all tests in export_tests.py [33/56]...success
> Running all tests in externals_tests.py [34/56]...success
> Running all tests in merge_tests.py [35/56]...FAILURE
> Running all tests in merge_authz_tests.py [36/56]...success
> Running all tests in revert_tests.py [37/56]...success
> Running all tests in mergeinfo_tests.py [38/56]...success
> Running all tests in stat_tests.py [39/56]...success
> Running all tests in trans_tests.py [40/56]...success
> Running all tests in autoprop_tests.py [41/56]...success
> Running all tests in blame_tests.py [42/56]...FAILURE
> Running all tests in special_tests.py [43/56]...success
> Running all tests in svnadmin_tests.py [44/56]...success
> Running all tests in svnlook_tests.py [45/56]...success
> Running all tests in svnversion_tests.py [46/56]...success
> Running all tests in utf8_tests.py [47/56]...success
> Running all tests in history_tests.py [48/56]...success
> Running all tests in lock_tests.py [49/56]...success
> Running all tests in cat_tests.py [50/56]...success
> Running all tests in import_tests.py [51/56]...success
> Running all tests in svnsync_tests.py [52/56]...success
> Running all tests in authz_tests.py [53/56]...success
> Running all tests in depth_tests.py [54/56]...success
> Running all tests in svndumpfilter_tests.py [55/56]...success
> Running all tests in changelist_tests.py [56/56]...success
> At least one test was SKIPPED, checking /www/erik/buildslave/eh-debsarge1/build/tests.log
> SKIP: update_tests.py 32: update wc on the root of a Windows (virtual) drive
> SKIP: utf8_tests.py 1: conversion of paths and logs to/from utf8
> At least one test FAILED, checking /www/erik/buildslave/eh-debsarge1/build/tests.log
> FAIL: merge_tests.py 85: cyclic merges dont add mergeinfo from own history
  ^^^^
Trying to track this down now. Some problem with ra_svn_reparent().

> FAIL: blame_tests.py 10: test 'svn blame -g'
> FAIL: blame_tests.py 11: don't look for merged files out of range
> make[1]: *** [check] Error 1
> make[1]: Leaving directory `/www/erik/buildslave/eh-debsarge1/build'
>
> real 69m40.217s
> user 43m18.486s
> sys 19m31.609s
> make: *** [svnserveautocheck] Error 2
> + s=2
> + test 2 '!=' 0
> + exit 2
>
>
> ---------------------------------------------------------------------
> To unsubscribe, e-mail: svn-breakage-unsubscribe_at_subversion.tigris.org
> For additional commands, e-mail: svn-breakage-help_at_subversion.tigris.org
>
>

---------------------------------------------------------------------
To unsubscribe, e-mail: dev-unsubscribe_at_subversion.tigris.org
For additional commands, e-mail: dev-help_at_subversion.tigris.org
Received on 2008-01-31 15:22:53 CET

This is an archived mail posted to the Subversion Dev mailing list.