[svn.haxx.se] · SVN Dev · SVN Users · SVN Org · TSVN Dev · TSVN Users · Subclipse Dev · Subclipse Users · this month's index

Re: svn rev 6255: FAIL (i686-pc-linux-gnu shared ra_local)

From: Branko Čibej <brane_at_xbc.nu>
Date: 2003-06-17 04:08:45 CEST

Looks like something between commits 6236 and 6255 broke the diff tests.
Funny thing, only test 4 fails over ra_dav.

brane@xbc.nu wrote:

>PASS: update apr
>PASS: update apr-util
>PASS: update subversion
>PASS: autogen.sh
>BUILD: Revision 6255 on i686-pc-linux-gnu shared
>PASS: check build type
>PASS: create object directory
>env CC='gcc-3.0' \
> "../repo/configure" \
> "--prefix=/home/brane/svn/inst" \
> "--with-berkeley-db=/usr/local/BerkeleyDB.4.0" \
> "--without-apxs" \
> "$@"
>PASS: configure
>PASS: build
>TEST: Revision 6255 on i686-pc-linux-gnu shared ra_local
>PASS: check build type
>PASS: check RA type
>PASS: check object directory
>PASS: check svn executable
>PASS: check svnadmin executable
>PASS: check svnlook executable
>PASS: check svnserve executable
>PASS: check svnversion executable
>Last 100 lines of the log file follow:
>Running all tests in config-test...success
>Running all tests in diff-diff3-test...success
>Running all tests in hashdump-test...success
>Running all tests in path-test...success
>Running all tests in random-test...success
>Running all tests in stream-test...success
>Running all tests in stringtest...success
>Running all tests in time-test...success
>Running all tests in translate-test...success
>Running all tests in target-test.py...success
>Running all tests in run-fs-tests.py...success
>Running all tests in run-repos-tests.py...success
>Running all tests in getopt_tests.py...success
>Running all tests in basic_tests.py...success
>Running all tests in commit_tests.py...success
>Running all tests in update_tests.py...success
>Running all tests in switch_tests.py...success
>Running all tests in prop_tests.py...success
>Running all tests in schedule_tests.py...success
>Running all tests in log_tests.py...success
>Running all tests in copy_tests.py...success
>Running all tests in diff_tests.py...FAILURE
>Running all tests in externals_tests.py...success
>Running all tests in merge_tests.py...success
>Running all tests in stat_tests.py...success
>Running all tests in trans_tests.py...success
>Running all tests in svnadmin_tests.py...success
>Running all tests in svnlook_tests.py...success
>Running all tests in svnversion_tests.py...success
>At least one test FAILED, checking /home/brane/svn/obj-sh/tests.log
>FAIL: diff_tests.py 1: update a file
>FAIL: diff_tests.py 3: add a file in an added directory
>FAIL: diff_tests.py 4: replace a file with a file
>FAIL: diff_tests.py 6: non-recursive behaviour
>make: *** [check] Error 1
>Complete log saved in /home/brane/svn/LOG_svn_check_shared_ra_local.6255.failed

Brane Čibej   <brane_at_xbc.nu>   http://www.xbc.nu/brane/
To unsubscribe, e-mail: dev-unsubscribe@subversion.tigris.org
For additional commands, e-mail: dev-help@subversion.tigris.org
Received on Tue Jun 17 04:09:32 2003

This is an archived mail posted to the Subversion Dev mailing list.

This site is subject to the Apache Privacy Policy and the Apache Public Forum Archive Policy.