[svn.haxx.se] · SVN Dev · SVN Users · SVN Org · TSVN Dev · TSVN Users · Subclipse Dev · Subclipse Users · this month's index

Re: ra_svn tests stuck in diff_tests.py

From: <bobgus_at_rcnChicago.com>
Date: 2003-01-22 14:19:09 CET

Changing the Makefile line from

davcheck:
        @make check BASE_URL=http://localhost
to

davcheck:
        @make check BASE_URL=http://192.168.49.21

and then running 'make davcheck' gives:

[root@hoho0 svn_new]# make davcheck 21 | tee davcheck2.out
make[1]: Entering directory `/usr/local/src/svn_new'
Running all tests in hashdump-test...success
Running all tests in path-test...success
Running all tests in random-test...success
Running all tests in stream-test...success
Running all tests in stringtest...success
Running all tests in time-test...success
Running all tests in translate-test...success
Running all tests in target-test.py...success
Running all tests in run-fs-tests.py...success
Running all tests in run-repos-tests.py...success
Running all tests in getopt_tests.py...success
Running all tests in basic_tests.py...success
Running all tests in commit_tests.py...success
Running all tests in update_tests.py...success
Running all tests in switch_tests.py...success
Running all tests in prop_tests.py...success
Running all tests in schedule_tests.py...success
Running all tests in log_tests.py...success
Running all tests in copy_tests.py...success
Running all tests in diff_tests.py...success
Running all tests in externals_tests.py...success
Running all tests in merge_tests.py...success
Running all tests in stat_tests.py...success
Running all tests in trans_tests.py...success
Running all tests in svnadmin_tests.py...success
Running all tests in svnlook_tests.py...success
Running all tests in svnversion_tests.py...success
make[1]: Leaving directory `/usr/local/src/svn_new'
[root@hoho0 svn_new]#

However, the tests.log does show some failures. Perhaps the test harness
considers these FAILs as not important - did not read that code as yet.

Following is the tests.log from the above tests

START: hashdump-test
PASS: lt-hashdump-test 1: write a hash to a file
PASS: lt-hashdump-test 2: read a file into a hash
PASS: lt-hashdump-test 3: write hash out, read back in, compare
END: hashdump-test

START: path-test
PASS: lt-path-test 1: test svn_path_is_child
PASS: lt-path-test 2: test svn_path_split
PASS: lt-path-test 3: test svn_path_is_url
PASS: lt-path-test 4: test svn_path_uri_[en/de]code
PASS: lt-path-test 5: test svn_path_join(_many)
PASS: lt-path-test 6: test svn_path_basename
PASS: lt-path-test 7: test svn_path_decompose
PASS: lt-path-test 8: test svn_path_decompose
END: path-test

START: random-test
SEED: random delta test, seed = 2948258990
PASS: lt-random-test 1: random delta test, seed = 2948258990
SEED: random combine delta test, seed = 2949656565
SEED: Last seen = 1222061641
PASS: lt-random-test 2: random combine delta test, seed = 2949656565
END: random-test

START: stream-test
PASS: lt-stream-test 1: test svn_stream_from_string
END: stream-test

START: stringtest
PASS: lt-stringtest 1: make svn_stringbuf_t from cstring
PASS: lt-stringtest 2: make svn_stringbuf_t from substring of cstring
PASS: lt-stringtest 3: append svn_stringbuf_t to svn_stringbuf_t
PASS: lt-stringtest 4: append C string to svn_stringbuf_t
PASS: lt-stringtest 5: append bytes, then compare two strings
PASS: lt-stringtest 6: dup two strings, then compare
PASS: lt-stringtest 7: chopping a string
PASS: lt-stringtest 8: emptying a string
PASS: lt-stringtest 9: fill string with hashmarks
PASS: lt-stringtest 10: block initialization and growth
PASS: lt-stringtest 11: formatting strings from varargs
PASS: lt-stringtest 12: create string from file
END: stringtest

START: time-test
PASS: lt-time-test 1: test svn_time_to_cstring
PASS: lt-time-test 2: test svn_time_from_cstring
PASS: lt-time-test 3: test svn_time_from_cstring (old format)
PASS: lt-time-test 4: test svn_time_to_cstring and svn_time_from_cstring
invariant
END: time-test

START: translate-test
PASS: lt-translate-test 1: no conversions
PASS: lt-translate-test 2: convert CRLF to CRLF
PASS: lt-translate-test 3: convert LF to CRLF
PASS: lt-translate-test 4: convert CR to CRLF
PASS: lt-translate-test 5: convert mixed line endings to CRLF
PASS: lt-translate-test 6: convert LF to LF
PASS: lt-translate-test 7: convert CRLF to LF
PASS: lt-translate-test 8: convert CR to LF
PASS: lt-translate-test 9: convert mixed line endings to LF
PASS: lt-translate-test 10: convert CRLF to CR
PASS: lt-translate-test 11: convert LF to CR
PASS: lt-translate-test 12: convert CR to CR
PASS: lt-translate-test 13: convert mixed line endings to CR
PASS: lt-translate-test 14: don't convert mixed line endings in absence of
repair flag
PASS: lt-translate-test 15: expand author keyword
PASS: lt-translate-test 16: expand date keyword
PASS: lt-translate-test 17: expand author and date keywords
PASS: lt-translate-test 18: expand author and rev keywords
PASS: lt-translate-test 19: expand rev keyword
PASS: lt-translate-test 20: expand rev and url keywords
PASS: lt-translate-test 21: expand author, date, rev, and url keywords
PASS: lt-translate-test 22: lf_to_crlf, plus expand author keyword
PASS: lt-translate-test 23: mixed_to_lf, plus expand author and date keywords
PASS: lt-translate-test 24: crlf_to_cr, plus expand author and rev keywords
PASS: lt-translate-test 25: cr_to_crlf, plus expand rev keyword
PASS: lt-translate-test 26: cr_to_crlf, plus expand rev and url keywords
PASS: lt-translate-test 27: mixed_to_crlf, plus expand author, date, rev,
and url keywords
PASS: lt-translate-test 28: unexpand author keyword
PASS: lt-translate-test 29: unexpand date keyword
PASS: lt-translate-test 30: unexpand author and date keywords
PASS: lt-translate-test 31: unexpand author and rev keywords
PASS: lt-translate-test 32: unexpand rev keyword
PASS: lt-translate-test 33: unexpand rev and url keywords
PASS: lt-translate-test 34: unexpand author, date, rev, and url keywords
PASS: lt-translate-test 35: lf_to_crlf, plus unexpand author keyword
PASS: lt-translate-test 36: mixed_to_lf, plus unexpand author and date
keywords
PASS: lt-translate-test 37: crlf_to_cr, plus unexpand author and rev keywords
PASS: lt-translate-test 38: cr_to_crlf, plus unexpand rev keyword
PASS: lt-translate-test 39: cr_to_crlf, plus unexpand rev and url keywords
PASS: lt-translate-test 40: mixed_to_crlf, plus unexpand author, date,
rev, and url keywords
END: translate-test

START: target-test.py
PASS: target-test 1: normal use
PASS: target-test 2: identical dirs
PASS: target-test 3: identical files
PASS: target-test 4: single dir
PASS: target-test 5: single file
END: target-test.py

START: run-fs-tests.py
  - removing repositories left over from previous test runs
  - running all sub-tests in key-test
PASS: lt-key-test 1: testing sequential alphanumeric key generation
  - running all sub-tests in skel-test
PASS: lt-skel-test 1: parse implicit-length atoms
PASS: lt-skel-test 2: parse explicit-length atoms
PASS: lt-skel-test 3: parse invalid atoms
PASS: lt-skel-test 4: parse lists
PASS: lt-skel-test 5: unparse implicit-length atoms
PASS: lt-skel-test 6: unparse lists
  - running all sub-tests in strings-reps-test
PASS: lt-strings-reps-test 1: Write a new rep, get a new key back.
PASS: lt-strings-reps-test 2: Write a new rep, then overwrite it.
PASS: lt-strings-reps-test 3: Write and overwrite a new rep; confirm with
reads.
PASS: lt-strings-reps-test 4: Write, then delete, a new rep; confirm deletion.
PASS: lt-strings-reps-test 5: Test many strings table functions together.
PASS: lt-strings-reps-test 6: Write a null string.
PASS: lt-strings-reps-test 7: Write a string, then abort during an overwrite.
PASS: lt-strings-reps-test 8: Create and copy a string
  - running all sub-tests in fs-test
PASS: lt-fs-test 1: svn_fs_create_berkeley
PASS: lt-fs-test 2: open an existing Berkeley DB filesystem
PASS: lt-fs-test 3: begin a txn, check its name, then close it
PASS: lt-fs-test 4: open an existing transaction by name
PASS: lt-fs-test 5: begin a txn, get the txn root, and add a file
PASS: lt-fs-test 6: create 2 txns, list them, and verify the list.
PASS: lt-fs-test 7: call functions with unopened filesystem and check errors
PASS: lt-fs-test 8: write and read a file's contents
PASS: lt-fs-test 9: make a file, a subdir, and another file in that subdir
PASS: lt-fs-test 10: make The Official Subversion Test Tree
PASS: lt-fs-test 11: fill a directory, then list it
PASS: lt-fs-test 12: set and get some revision properties
PASS: lt-fs-test 13: set/get txn props, commit, validate new rev props
PASS: lt-fs-test 14: set and get some node properties
PASS: lt-fs-test 15: delete mutable nodes from directories
PASS: lt-fs-test 16: delete nodes tree
PASS: lt-fs-test 17: abort a transaction
PASS: lt-fs-test 18: testing tree validation helper
PASS: lt-fs-test 19: fetch the youngest revision from a filesystem
PASS: lt-fs-test 20: basic commit
PASS: lt-fs-test 21: copying and tracking copy history
svn: Test failed
svn: XFAIL
XFAIL: lt-fs-test 22: linking, so no copy history
PASS: lt-fs-test 23: merging commit
PASS: lt-fs-test 24: commit datestamps
PASS: lt-fs-test 25: check old revisions
PASS: lt-fs-test 26: after each commit, check all revisions
PASS: lt-fs-test 27: create, modify, and verify a medium file
(seed=3001192824)
PASS: lt-fs-test 28: create, modify, and verify a large file (seed=3110735570)
PASS: lt-fs-test 29: make sure the root node's stored revision is accurate
PASS: lt-fs-test 30: pound on explicit undeltification code (seed=3225002787)
PASS: lt-fs-test 31: svn_fs_node_created_rev test
PASS: lt-fs-test 32: test svn_fs_check_related
PASS: lt-fs-test 33: test svn_fs_revisions_changed
PASS: lt-fs-test 34: test svn_fs__canonicalize_abspath
PASS: lt-fs-test 35: test complex copies (branches)
PASS: lt-fs-test 36: test checksums
END: run-fs-tests.py

START: run-repos-tests.py
  - removing repositories left over from previous test runs
  - running all sub-tests in repos-test
PASS: lt-repos-test 1: test svn_repos_dir_delta
END: run-repos-tests.py

START: getopt_tests.py
CMD: svn
PASS: getopt_tests.py 1: run svn with no arguments
CMD: svn --version
PASS: getopt_tests.py 2: run svn --version
CMD: svn --version --quiet
PASS: getopt_tests.py 3: run svn --version --quiet
CMD: svn --help
PASS: getopt_tests.py 4: run svn --help
CMD: svn help
PASS: getopt_tests.py 5: run svn help
CMD: svn help --version
PASS: getopt_tests.py 6: run svn help --version
CMD: svn help bogus-cmd
PASS: getopt_tests.py 7: run svn help bogus-cmd
CMD: svn help log switch
PASS: getopt_tests.py 8: run svn help log switch
END: getopt_tests.py

START: basic_tests.py
CMD: svnadmin create local_tmp/repos
CMD: svn import --username apache --password jandom -m Log
message for revision 1. http://192.168.49.21/local_tmp/repos
local_tmp/greekfiles
CMD: svnadmin create repositories/basic_tests-1
CMD: svnadmin dump local_tmp/repos | svnadmin load
repositories/basic_tests-1
CMD: svn co --username apache --password jandom
http://192.168.49.21/repositories/basic_tests-1
working_copies/basic_tests-1
CMD: svn co http://192.168.49.21/repositories/basic_tests-1/A
--username apache --password jandom working_copies/basic_tests-1
CMD: svn rm working_copies/basic_tests-1/A/D/G
CMD: svn status -v -u -q working_copies/basic_tests-1
CMD: svn co http://192.168.49.21/repositories/basic_tests-1
--username apache --password jandom working_copies/basic_tests-1
CMD: svn status -v -u -q working_copies/basic_tests-1
PASS: basic_tests.py 1: basic checkout of a wc
CMD: svnadmin create repositories/basic_tests-2
CMD: svnadmin dump local_tmp/repos | svnadmin load
repositories/basic_tests-2
CMD: svn co --username apache --password jandom
http://192.168.49.21/repositories/basic_tests-2
working_copies/basic_tests-2
CMD: svn status -v -u -q working_copies/basic_tests-2
PASS: basic_tests.py 2: basic status command
CMD: svnadmin create repositories/basic_tests-3
CMD: svnadmin dump local_tmp/repos | svnadmin load
repositories/basic_tests-3
CMD: svn co --username apache --password jandom
http://192.168.49.21/repositories/basic_tests-3
working_copies/basic_tests-3
CMD: svn ci -m log msg working_copies/basic_tests-3
CMD: svn status -v -u -q working_copies/basic_tests-3
PASS: basic_tests.py 3: basic commit command
CMD: svnadmin create repositories/basic_tests-4
CMD: svnadmin dump local_tmp/repos | svnadmin load
repositories/basic_tests-4
CMD: svn co --username apache --password jandom
http://192.168.49.21/repositories/basic_tests-4
working_copies/basic_tests-4
CMD: svn ci -m log msg working_copies/basic_tests-4
CMD: svn status -v -u -q working_copies/basic_tests-4
CMD: svn up working_copies/basic_tests-4backup
CMD: svn status -v -u -q working_copies/basic_tests-4backup
PASS: basic_tests.py 4: basic update command
CMD: svnadmin create repositories/basic_tests-5
CMD: svnadmin dump local_tmp/repos | svnadmin load
repositories/basic_tests-5
CMD: svn co --username apache --password jandom
http://192.168.49.21/repositories/basic_tests-5
working_copies/basic_tests-5
CMD: svn ci -m log msg working_copies/basic_tests-5
CMD: svn ci -m log msg working_copies/basic_tests-5
CMD: svn status -v -u -q working_copies/basic_tests-5
CMD: svn up working_copies/basic_tests-5-other
CMD: svn up working_copies/basic_tests-5-other
CMD: svn status -v -u -q working_copies/basic_tests-5-other
PASS: basic_tests.py 5: basic corruption detection
CMD: svnadmin create repositories/basic_tests-6
CMD: svnadmin dump local_tmp/repos | svnadmin load
repositories/basic_tests-6
CMD: svn co --username apache --password jandom
http://192.168.49.21/repositories/basic_tests-6
working_copies/basic_tests-6
CMD: svn ci -m log msg working_copies/basic_tests-6
CMD: svn status -v -u -q working_copies/basic_tests-6
CMD: svn ci -m log msg working_copies/basic_tests-6
CMD: svn status -v -u -q working_copies/basic_tests-6
CMD: svn up working_copies/basic_tests-6backup
CMD: svn status -v -u -q working_copies/basic_tests-6backup
PASS: basic_tests.py 6: receiving text merges as part of an update
CMD: svnadmin create repositories/basic_tests-7
CMD: svnadmin dump local_tmp/repos | svnadmin load
repositories/basic_tests-7
CMD: svn co --username apache --password jandom
http://192.168.49.21/repositories/basic_tests-7
working_copies/basic_tests-7
CMD: svn ci -m log msg working_copies/basic_tests-7
CMD: svn status -v -u -q working_copies/basic_tests-7
CMD: svn up working_copies/basic_tests-7backup
CMD: svn status -v -u -q working_copies/basic_tests-7backup
CMD: svn resolve working_copies/basic_tests-7backup/A/mu
working_copies/basic_tests-7backup/A/D/G/rho
CMD: svn status -v -u -q working_copies/basic_tests-7backup
PASS: basic_tests.py 7: basic conflict creation and resolution
CMD: svnadmin create repositories/basic_tests-8
CMD: svnadmin dump local_tmp/repos | svnadmin load
repositories/basic_tests-8
CMD: svn co --username apache --password jandom
http://192.168.49.21/repositories/basic_tests-8
working_copies/basic_tests-8
CMD: svn status -v -u -q working_copies/basic_tests-8
CMD: svn cleanup working_copies/basic_tests-8
CMD: svn status -v -u -q working_copies/basic_tests-8
PASS: basic_tests.py 8: basic cleanup command
CMD: svnadmin create repositories/basic_tests-9
CMD: svnadmin dump local_tmp/repos | svnadmin load
repositories/basic_tests-9
CMD: svn co --username apache --password jandom
http://192.168.49.21/repositories/basic_tests-9
working_copies/basic_tests-9
CMD: svn add working_copies/basic_tests-9/A/D/H/zeta
CMD: svn status -v -u -q working_copies/basic_tests-9
CMD: svn revert working_copies/basic_tests-9/A/B/E/beta
CMD: svn revert working_copies/basic_tests-9/iota
CMD: svn revert working_copies/basic_tests-9/A/D/G/rho
CMD: svn revert working_copies/basic_tests-9/A/D/H/zeta
CMD: svn status -v -u -q working_copies/basic_tests-9
CMD: svn revert working_copies/basic_tests-9/A/B/E/beta
CMD: svn mkdir working_copies/basic_tests-9/X
CMD: svn status -v -u -q working_copies/basic_tests-9
CMD: svn revert working_copies/basic_tests-9/X
CMD: svn status -v -u -q working_copies/basic_tests-9
CMD: svn rm working_copies/basic_tests-9/A/B/E
CMD: svn status -v -u -q working_copies/basic_tests-9
CMD: svn revert working_copies/basic_tests-9/A/B/E
CMD: svn status -v -u -q working_copies/basic_tests-9
PASS: basic_tests.py 9: basic revert command
CMD: svnadmin create repositories/basic_tests-10
CMD: svnadmin dump local_tmp/repos | svnadmin load
repositories/basic_tests-10
CMD: svn co --username apache --password jandom
http://192.168.49.21/repositories/basic_tests-10
working_copies/basic_tests-10
CMD: svn switch --username apache --password jandom
http://192.168.49.21/repositories/basic_tests-10/A/D/gamma
working_copies/basic_tests-10/iota
CMD: svn status -v -u -q working_copies/basic_tests-10
CMD: svn switch --username apache --password jandom
http://192.168.49.21/repositories/basic_tests-10/A/D/G
working_copies/basic_tests-10/A/D/H
CMD: svn status -v -u -q working_copies/basic_tests-10
PASS: basic_tests.py 10: basic switch command
CMD: svnadmin create repositories/basic_tests-11
CMD: svnadmin dump local_tmp/repos | svnadmin load
repositories/basic_tests-11
CMD: svn co --username apache --password jandom
http://192.168.49.21/repositories/basic_tests-11
working_copies/basic_tests-11
CMD: svn ps abc def working_copies/basic_tests-11/A/D/G/rho
CMD: svn ps abc def working_copies/basic_tests-11/A/B/F
CMD: svn mkdir working_copies/basic_tests-11/A/B/X
CMD: svn add working_copies/basic_tests-11/A/B/X/xi
CMD: svn mkdir working_copies/basic_tests-11/A/D/Y
CMD: svn status -v -u -q working_copies/basic_tests-11
CMD: svn rm working_copies/basic_tests-11/A/D/H/chi
CMD: svn rm working_copies/basic_tests-11/A/D/H
CMD: svn rm working_copies/basic_tests-11/A/D/G/rho
CMD: svn rm working_copies/basic_tests-11/A/D/G
CMD: svn rm working_copies/basic_tests-11/A/B/F
CMD: svn rm working_copies/basic_tests-11/A/B
CMD: svn rm working_copies/basic_tests-11/A/C/sigma
CMD: svn rm working_copies/basic_tests-11/A/C
CMD: svn rm working_copies/basic_tests-11/A/B/X
CMD: svn status -v -u -q working_copies/basic_tests-11
CMD: svn rm working_copies/basic_tests-11/A/B/E
CMD: svn rm --force working_copies/basic_tests-11/A/D/H
CMD: svn rm --force working_copies/basic_tests-11/A/D/G
CMD: svn rm --force working_copies/basic_tests-11/A/B/F
CMD: svn rm --force working_copies/basic_tests-11/A/C
CMD: svn rm --force working_copies/basic_tests-11/A/B/X
CMD: svn rm --force working_copies/basic_tests-11/iota
CMD: svn rm working_copies/basic_tests-11/A/D/gamma
CMD: svn rm working_copies/basic_tests-11/A/D/gamma
CMD: svn rm working_copies/basic_tests-11/A/B/E
CMD: svn status -v -u -q working_copies/basic_tests-11
CMD: svn rm --force working_copies/basic_tests-11/A/D
CMD: svn status -v -u -q working_copies/basic_tests-11
CMD: svn rm --force working_copies/basic_tests-11/foo
CMD: svn rm --force working_copies/basic_tests-11/foo
PASS: basic_tests.py 11: basic delete command
CMD: svnadmin create repositories/basic_tests-12
CMD: svnadmin dump local_tmp/repos | svnadmin load
repositories/basic_tests-12
CMD: svn co --username apache --password jandom
http://192.168.49.21/repositories/basic_tests-12
working_copies/basic_tests-12
CMD: svn rm --force working_copies/basic_tests-12/A/D
CMD: svn ci -m log msg working_copies/basic_tests-12
CMD: svn status -v -u -q working_copies/basic_tests-12
CMD: svn co -r 1 --username apache --password jandom
http://192.168.49.21/repositories/basic_tests-12/A/D
working_copies/basic_tests-12/new_D
PASS: basic_tests.py 12: checkout a path no longer in HEAD
CMD: svnadmin create repositories/basic_tests-13
CMD: svnadmin dump local_tmp/repos | svnadmin load
repositories/basic_tests-13
CMD: svn co --username apache --password jandom
http://192.168.49.21/repositories/basic_tests-13
working_copies/basic_tests-13
CMD: svn rm working_copies/basic_tests-13/A/D/gamma
CMD: svn status -v -u -q working_copies/basic_tests-13
CMD: svn mkdir working_copies/basic_tests-13/A/D/gamma
CMD: svn status -v -u -q working_copies/basic_tests-13
CMD: svn ci -m log msg working_copies/basic_tests-13
CMD: svn status -v -u -q working_copies/basic_tests-13
CMD: svn mkdir working_copies/basic_tests-13/A/D/gamma
CMD: svn status -v -u -q working_copies/basic_tests-13
CMD: svn up working_copies/basic_tests-13
CMD: svn mkdir working_copies/basic_tests-13/A/D/gamma
CMD: svn status -v -u -q working_copies/basic_tests-13
PASS: basic_tests.py 13: attempt to change node kind
CMD: svnadmin create repositories/basic_tests-14
CMD: svnadmin dump local_tmp/repos | svnadmin load
repositories/basic_tests-14
CMD: svn co --username apache --password jandom
http://192.168.49.21/repositories/basic_tests-14
working_copies/basic_tests-14
CMD: svn import --username apache --password jandom -m Log
message for new import http://192.168.49.21/repositories/basic_tests-14
working_copies/basic_tests-14/new_file new_file
CMD: svn up working_copies/basic_tests-14
CMD: svn proplist working_copies/basic_tests-14 --verbose
CMD: svn proplist working_copies/basic_tests-14/iota --verbose
CMD: svn proplist working_copies/basic_tests-14/new_file --verbose
CMD: svn proplist working_copies/basic_tests-14/A --verbose
CMD: svn proplist working_copies/basic_tests-14/A/mu --verbose
CMD: svn proplist working_copies/basic_tests-14/A/D --verbose
CMD: svn proplist working_copies/basic_tests-14/A/D/gamma --verbose
CMD: svn proplist working_copies/basic_tests-14/A/D/H --verbose
CMD: svn proplist working_copies/basic_tests-14/A/D/H/omega --verbose
CMD: svn proplist working_copies/basic_tests-14/A/D/H/psi --verbose
CMD: svn proplist working_copies/basic_tests-14/A/D/H/chi --verbose
CMD: svn proplist working_copies/basic_tests-14/A/D/G --verbose
CMD: svn proplist working_copies/basic_tests-14/A/D/G/tau --verbose
CMD: svn proplist working_copies/basic_tests-14/A/D/G/rho --verbose
CMD: svn proplist working_copies/basic_tests-14/A/D/G/pi --verbose
CMD: svn proplist working_copies/basic_tests-14/A/C --verbose
CMD: svn proplist working_copies/basic_tests-14/A/B --verbose
CMD: svn proplist working_copies/basic_tests-14/A/B/lambda --verbose
CMD: svn proplist working_copies/basic_tests-14/A/B/F --verbose
CMD: svn proplist working_copies/basic_tests-14/A/B/E --verbose
CMD: svn proplist working_copies/basic_tests-14/A/B/E/alpha --verbose
CMD: svn proplist working_copies/basic_tests-14/A/B/E/beta --verbose
CMD: svn status -v -u -q working_copies/basic_tests-14
PASS: basic_tests.py 14: basic import of single new file
CMD: svnadmin create repositories/basic_tests-15
CMD: svnadmin dump local_tmp/repos | svnadmin load
repositories/basic_tests-15
CMD: svn co --username apache --password jandom
http://192.168.49.21/repositories/basic_tests-15
working_copies/basic_tests-15
CMD: svn cat --username apache --password jandom
working_copies/basic_tests-15/A/mu
PASS: basic_tests.py 15: basic cat of files
CMD: svnadmin create repositories/basic_tests-16
CMD: svnadmin dump local_tmp/repos | svnadmin load
repositories/basic_tests-16
CMD: svn co --username apache --password jandom
http://192.168.49.21/repositories/basic_tests-16
working_copies/basic_tests-16
CMD: svn import --username apache --password jandom -m Log
message for new import http://192.168.49.21/repositories/basic_tests-16
working_copies/basic_tests-16/XT
CMD: svn up working_copies/basic_tests-16
CMD: svn proplist working_copies/basic_tests-16 --verbose
CMD: svn proplist working_copies/basic_tests-16/iota --verbose
CMD: svn proplist working_copies/basic_tests-16/other_exe --verbose
CMD: svn proplist working_copies/basic_tests-16/user_exe --verbose
CMD: svn proplist working_copies/basic_tests-16/none_exe --verbose
CMD: svn proplist working_copies/basic_tests-16/group_exe --verbose
CMD: svn proplist working_copies/basic_tests-16/all_exe --verbose
CMD: svn proplist working_copies/basic_tests-16/A --verbose
CMD: svn proplist working_copies/basic_tests-16/A/mu --verbose
CMD: svn proplist working_copies/basic_tests-16/A/D --verbose
CMD: svn proplist working_copies/basic_tests-16/A/D/gamma --verbose
CMD: svn proplist working_copies/basic_tests-16/A/D/H --verbose
CMD: svn proplist working_copies/basic_tests-16/A/D/H/omega --verbose
CMD: svn proplist working_copies/basic_tests-16/A/D/H/psi --verbose
CMD: svn proplist working_copies/basic_tests-16/A/D/H/chi --verbose
CMD: svn proplist working_copies/basic_tests-16/A/D/G --verbose
CMD: svn proplist working_copies/basic_tests-16/A/D/G/tau --verbose
CMD: svn proplist working_copies/basic_tests-16/A/D/G/rho --verbose
CMD: svn proplist working_copies/basic_tests-16/A/D/G/pi --verbose
CMD: svn proplist working_copies/basic_tests-16/A/C --verbose
CMD: svn proplist working_copies/basic_tests-16/A/B --verbose
CMD: svn proplist working_copies/basic_tests-16/A/B/lambda --verbose
CMD: svn proplist working_copies/basic_tests-16/A/B/F --verbose
CMD: svn proplist working_copies/basic_tests-16/A/B/E --verbose
CMD: svn proplist working_copies/basic_tests-16/A/B/E/alpha --verbose
CMD: svn proplist working_copies/basic_tests-16/A/B/E/beta --verbose
CMD: svn status -v -u -q working_copies/basic_tests-16
PASS: basic_tests.py 16: basic import of executable files
CMD: svn log file:///nonexistent_path
PASS: basic_tests.py 17: 'svn log file:///nonexistent_path' should fail
CMD: svnadmin create repositories/basic_tests-18
CMD: svnadmin dump local_tmp/repos | svnadmin load
repositories/basic_tests-18
CMD: svn co --username apache --password jandom
http://192.168.49.21/repositories/basic_tests-18
working_copies/basic_tests-18
CMD: svn checkout --username apache --password jandom
--no-auth-cache http://192.168.49.21/repositories/basic_tests-18
working_copies/basic_tests-18
CMD: svn status -u --username apache --password jandom
working_copies/basic_tests-18/A/B
CMD: svn copy --username apache --password jandom
http://192.168.49.21/repositories/basic_tests-18/A/B/E
working_copies/basic_tests-18/A/D/G
PASS: basic_tests.py 18: basic auth caching
END: basic_tests.py

START: commit_tests.py
CMD: svnadmin create local_tmp/repos
CMD: svn import --username apache --password jandom -m Log
message for revision 1. http://192.168.49.21/local_tmp/repos
local_tmp/greekfiles
CMD: svnadmin create repositories/commit_tests-1
CMD: svnadmin dump local_tmp/repos | svnadmin load
repositories/commit_tests-1
CMD: svn co --username apache --password jandom
http://192.168.49.21/repositories/commit_tests-1
working_copies/commit_tests-1
CMD: svn add Q
CMD: svn rm A/B/E
CMD: svn rm A/C
CMD: svn add A/B/E
CMD: svn propset foo bar .
CMD: svn propset foo2 bar2 A/D
CMD: svn add A/B/E/bloo
CMD: svn add A/D/H/gloo
CMD: svn add Q/floo
CMD: svn rm A/D/G/rho
CMD: svn rm A/D/H/chi
CMD: svn rm A/D/gamma
CMD: svn add A/D/H/chi
CMD: svn propset blue azul A/D/H/omega
CMD: svn propset green verde Q/floo
CMD: svn propset red rojo A/D/G/pi
CMD: svn status -v -u -q working_copies/commit_tests-1
CMD: svn ci -m log msg working_copies/commit_tests-1/A/D/H/omega
CMD: svn status -v -u -q working_copies/commit_tests-1
PASS: commit_tests.py 1: commit one file.
CMD: svnadmin create repositories/commit_tests-2
CMD: svnadmin dump local_tmp/repos | svnadmin load
repositories/commit_tests-2
CMD: svn co --username apache --password jandom
http://192.168.49.21/repositories/commit_tests-2
working_copies/commit_tests-2
CMD: svn add Q
CMD: svn rm A/B/E
CMD: svn rm A/C
CMD: svn add A/B/E
CMD: svn propset foo bar .
CMD: svn propset foo2 bar2 A/D
CMD: svn add A/B/E/bloo
CMD: svn add A/D/H/gloo
CMD: svn add Q/floo
CMD: svn rm A/D/G/rho
CMD: svn rm A/D/H/chi
CMD: svn rm A/D/gamma
CMD: svn add A/D/H/chi
CMD: svn propset blue azul A/D/H/omega
CMD: svn propset green verde Q/floo
CMD: svn propset red rojo A/D/G/pi
CMD: svn status -v -u -q working_copies/commit_tests-2
CMD: svn ci -m log msg working_copies/commit_tests-2/A/D/H/gloo
CMD: svn status -v -u -q working_copies/commit_tests-2
PASS: commit_tests.py 2: commit one newly added file.
CMD: svnadmin create repositories/commit_tests-3
CMD: svnadmin dump local_tmp/repos | svnadmin load
repositories/commit_tests-3
CMD: svn co --username apache --password jandom
http://192.168.49.21/repositories/commit_tests-3
working_copies/commit_tests-3
CMD: svn add Q
CMD: svn rm A/B/E
CMD: svn rm A/C
CMD: svn add A/B/E
CMD: svn propset foo bar .
CMD: svn propset foo2 bar2 A/D
CMD: svn add A/B/E/bloo
CMD: svn add A/D/H/gloo
CMD: svn add Q/floo
CMD: svn rm A/D/G/rho
CMD: svn rm A/D/H/chi
CMD: svn rm A/D/gamma
CMD: svn add A/D/H/chi
CMD: svn propset blue azul A/D/H/omega
CMD: svn propset green verde Q/floo
CMD: svn propset red rojo A/D/G/pi
CMD: svn status -v -u -q working_copies/commit_tests-3
CMD: svn propset svn:mime-type application/octet-stream
working_copies/commit_tests-3/A/D/H/gloo
CMD: svn ci -m log msg working_copies/commit_tests-3/A/D/H/gloo
CMD: svn status -v -u -q working_copies/commit_tests-3
PASS: commit_tests.py 3: commit one newly added binary file.
CMD: svnadmin create repositories/commit_tests-4
CMD: svnadmin dump local_tmp/repos | svnadmin load
repositories/commit_tests-4
CMD: svn co --username apache --password jandom
http://192.168.49.21/repositories/commit_tests-4
working_copies/commit_tests-4
CMD: svn propset foo bar working_copies/commit_tests-4/A/D/G
CMD: svn ci -m log msg working_copies/commit_tests-4/A/D/H/psi
working_copies/commit_tests-4/A/B working_copies/commit_tests-4/A/D/G/pi
CMD: svn status -v -u -q working_copies/commit_tests-4
PASS: commit_tests.py 4: commit multiple targets
CMD: svnadmin create repositories/commit_tests-5
CMD: svnadmin dump local_tmp/repos | svnadmin load
repositories/commit_tests-5
CMD: svn co --username apache --password jandom
http://192.168.49.21/repositories/commit_tests-5
working_copies/commit_tests-5
CMD: svn propset foo bar working_copies/commit_tests-5/A/D/G
CMD: svn ci -m log msg working_copies/commit_tests-5/A/D/H/psi
working_copies/commit_tests-5/A/B
working_copies/commit_tests-5/A/D/H/omega
working_copies/commit_tests-5/A/D/G/pi
CMD: svn status -v -u -q working_copies/commit_tests-5
PASS: commit_tests.py 5: commit multiple targets, 2nd variation
CMD: svnadmin create repositories/commit_tests-6
CMD: svnadmin dump local_tmp/repos | svnadmin load
repositories/commit_tests-6
CMD: svn co --username apache --password jandom
http://192.168.49.21/repositories/commit_tests-6
working_copies/commit_tests-6
CMD: svn add Q
CMD: svn rm A/B/E
CMD: svn rm A/C
CMD: svn add A/B/E
CMD: svn propset foo bar .
CMD: svn propset foo2 bar2 A/D
CMD: svn add A/B/E/bloo
CMD: svn add A/D/H/gloo
CMD: svn add Q/floo
CMD: svn rm A/D/G/rho
CMD: svn rm A/D/H/chi
CMD: svn rm A/D/gamma
CMD: svn add A/D/H/chi
CMD: svn propset blue azul A/D/H/omega
CMD: svn propset green verde Q/floo
CMD: svn propset red rojo A/D/G/pi
CMD: svn status -v -u -q working_copies/commit_tests-6
CMD: svn ci -m log msg working_copies/commit_tests-6/A/D
CMD: svn status -v -u -q working_copies/commit_tests-6
PASS: commit_tests.py 6: commit wc_dir/A/D -- includes D. (anchor=A, tgt=D)
CMD: svnadmin create repositories/commit_tests-7
CMD: svnadmin dump local_tmp/repos | svnadmin load
repositories/commit_tests-7
CMD: svn co --username apache --password jandom
http://192.168.49.21/repositories/commit_tests-7
working_copies/commit_tests-7
CMD: svn add Q
CMD: svn rm A/B/E
CMD: svn rm A/C
CMD: svn add A/B/E
CMD: svn propset foo bar .
CMD: svn propset foo2 bar2 A/D
CMD: svn add A/B/E/bloo
CMD: svn add A/D/H/gloo
CMD: svn add Q/floo
CMD: svn rm A/D/G/rho
CMD: svn rm A/D/H/chi
CMD: svn rm A/D/gamma
CMD: svn add A/D/H/chi
CMD: svn propset blue azul A/D/H/omega
CMD: svn propset green verde Q/floo
CMD: svn propset red rojo A/D/G/pi
CMD: svn status -v -u -q working_copies/commit_tests-7
CMD: svn ci -m log msg working_copies/commit_tests-7
CMD: svn status -v -u -q working_copies/commit_tests-7
PASS: commit_tests.py 7: commit wc_dir -- (anchor=wc_dir, tgt={})
CMD: svnadmin create repositories/commit_tests-8
CMD: svnadmin dump local_tmp/repos | svnadmin load
repositories/commit_tests-8
CMD: svn co --username apache --password jandom
http://192.168.49.21/repositories/commit_tests-8
working_copies/commit_tests-8
CMD: svn ci -m log msg working_copies/commit_tests-8/blorg
PASS: commit_tests.py 8: committing unversioned object produces error
CMD: svnadmin create repositories/commit_tests-9
CMD: svnadmin dump local_tmp/repos | svnadmin load
repositories/commit_tests-9
CMD: svn co --username apache --password jandom
http://192.168.49.21/repositories/commit_tests-9
working_copies/commit_tests-9
CMD: svn rm working_copies/commit_tests-9/A/D
CMD: svn add -N working_copies/commit_tests-9/A/D
CMD: svn add -N working_copies/commit_tests-9/A/D/H
CMD: svn add working_copies/commit_tests-9/A/D/bloo
CMD: svn status -v -u -q working_copies/commit_tests-9
CMD: svn ci -m log msg working_copies/commit_tests-9
CMD: svn status -v -u -q working_copies/commit_tests-9
PASS: commit_tests.py 9: replace two nested dirs, verify empty contents
CMD: svnadmin create repositories/commit_tests-10
CMD: svnadmin dump local_tmp/repos | svnadmin load
repositories/commit_tests-10
CMD: svn co --username apache --password jandom
http://192.168.49.21/repositories/commit_tests-10
working_copies/commit_tests-10
CMD: svn rm working_copies/commit_tests-10/A/D/gamma
CMD: svn ci -m log msg working_copies/commit_tests-10
CMD: svn status -v -u -q working_copies/commit_tests-10
CMD: svn up working_copies/commit_tests-10
CMD: svn status -v -u -q working_copies/commit_tests-10
PASS: commit_tests.py 10: hudson prob 1.0: delete file, commit, update
CMD: svnadmin create repositories/commit_tests-11
CMD: svnadmin dump local_tmp/repos | svnadmin load
repositories/commit_tests-11
CMD: svn co --username apache --password jandom
http://192.168.49.21/repositories/commit_tests-11
working_copies/commit_tests-11
CMD: svn rm working_copies/commit_tests-11/A/D/H
CMD: svn ci -m log msg working_copies/commit_tests-11
CMD: svn status -v -u -q working_copies/commit_tests-11
CMD: svn up working_copies/commit_tests-11
CMD: svn status -v -u -q working_copies/commit_tests-11
PASS: commit_tests.py 11: hudson prob 1.1: delete dir, commit, update
CMD: svnadmin create repositories/commit_tests-12
CMD: svnadmin dump local_tmp/repos | svnadmin load
repositories/commit_tests-12
CMD: svn co --username apache --password jandom
http://192.168.49.21/repositories/commit_tests-12
working_copies/commit_tests-12
CMD: svn rm working_copies/commit_tests-12/A/D/gamma
CMD: svn ci -m log msg working_copies/commit_tests-12
CMD: svn status -v -u -q working_copies/commit_tests-12
CMD: svn add working_copies/commit_tests-12/A/D/gamma
CMD: svn status -v -u -q working_copies/commit_tests-12
CMD: svn ci -m log msg working_copies/commit_tests-12
CMD: svn status -v -u -q working_copies/commit_tests-12
PASS: commit_tests.py 12: hudson prob 1.2: delete, commit, re-add, commit
CMD: svnadmin create repositories/commit_tests-13
CMD: svnadmin dump local_tmp/repos | svnadmin load
repositories/commit_tests-13
CMD: svn co --username apache --password jandom
http://192.168.49.21/repositories/commit_tests-13
working_copies/commit_tests-13
CMD: svn rm working_copies/commit_tests-13/A/D/gamma
CMD: svn ci -m log msg working_copies/commit_tests-13
CMD: svn status -v -u -q working_copies/commit_tests-13
CMD: svn ps foo bar working_copies/commit_tests-13/A/D
CMD: svn ci -m log msg working_copies/commit_tests-13
PASS: commit_tests.py 13: hudson prob 2.0: prop commit on old dir fails.
CMD: svnadmin create repositories/commit_tests-14
CMD: svnadmin dump local_tmp/repos | svnadmin load
repositories/commit_tests-14
CMD: svn co --username apache --password jandom
http://192.168.49.21/repositories/commit_tests-14
working_copies/commit_tests-14
CMD: svn ci --quiet -m log msg working_copies/commit_tests-14
XFAIL: commit_tests.py 14: hook testing.
CMD: svnadmin create repositories/commit_tests-15
CMD: svnadmin dump local_tmp/repos | svnadmin load
repositories/commit_tests-15
CMD: svn co --username apache --password jandom
http://192.168.49.21/repositories/commit_tests-15
working_copies/commit_tests-15
CMD: svn ci -m log msg working_copies/commit_tests-15
CMD: svn status -v -u -q working_copies/commit_tests-15
CMD: svn up working_copies/commit_tests-15/A/D/H
CMD: svn status -v -u -q working_copies/commit_tests-15/A/D/H
CMD: svn ci -m log msg working_copies/commit_tests-15
CMD: svn status -v -u -q working_copies/commit_tests-15
CMD: svn ci -m log msg working_copies/commit_tests-15
CMD: svn status -v -u -q working_copies/commit_tests-15
CMD: svn ci -m log msg working_copies/commit_tests-15
CMD: svn status -v -u -q working_copies/commit_tests-15
CMD: svn ci -m log msg working_copies/commit_tests-15
CMD: svn status -v -u -q working_copies/commit_tests-15
PASS: commit_tests.py 15: commit mixed-rev wc (no erronous merge error)
CMD: svnadmin create repositories/commit_tests-16
CMD: svnadmin dump local_tmp/repos | svnadmin load
repositories/commit_tests-16
CMD: svn co --username apache --password jandom
http://192.168.49.21/repositories/commit_tests-16
working_copies/commit_tests-16
CMD: svn add --non-recursive working_copies/commit_tests-16/#hash#
CMD: svn add --non-recursive working_copies/commit_tests-16/#![]{}()%
CMD: svn add --non-recursive working_copies/commit_tests-16/A/D/space
path
CMD: svn add --non-recursive working_copies/commit_tests-16/A/D/H/bang!
CMD: svn add --non-recursive working_copies/commit_tests-16/A/D/H/bra[ket
CMD: svn add --non-recursive working_copies/commit_tests-16/A/D/H/bra{e
CMD: svn add --non-recursive working_copies/commit_tests-16/A/D/H/angle
CMD: svn add --non-recursive
working_copies/commit_tests-16/A/D/pare)(theses
CMD: svn add --non-recursive
working_copies/commit_tests-16/#hash#/percen%
CMD: svn add --non-recursive working_copies/commit_tests-16/A/#![]{}()%
CMD: svn ci -m log msg working_copies/commit_tests-16
CMD: svn status -v -u -q working_copies/commit_tests-16
PASS: commit_tests.py 16: commit files and dirs with URI-unsafe characters
CMD: svnadmin create repositories/commit_tests-17
CMD: svnadmin dump local_tmp/repos | svnadmin load
repositories/commit_tests-17
CMD: svn co --username apache --password jandom
http://192.168.49.21/repositories/commit_tests-17
working_copies/commit_tests-17
CMD: svn remove --force working_copies/commit_tests-17/iota
CMD: svn remove --force working_copies/commit_tests-17/A/mu
CMD: svn ci -m log msg working_copies/commit_tests-17
CMD: svn status -v -u -q working_copies/commit_tests-17
PASS: commit_tests.py 17: commit files that have been deleted, but also edited
CMD: svnadmin create repositories/commit_tests-18
CMD: svnadmin dump local_tmp/repos | svnadmin load
repositories/commit_tests-18
CMD: svn co --username apache --password jandom
http://192.168.49.21/repositories/commit_tests-18
working_copies/commit_tests-18
CMD: svn move working_copies/commit_tests-18/A
working_copies/commit_tests-18/Z
CMD: svn ci -m log msg working_copies/commit_tests-18/Z/mu
CMD: svn add working_copies/commit_tests-18/Q
CMD: svn ci -m log msg working_copies/commit_tests-18/Q/bloo
PASS: commit_tests.py 18: commit a file inside dir scheduled for addition
CMD: svnadmin create repositories/commit_tests-19
CMD: svnadmin dump local_tmp/repos | svnadmin load
repositories/commit_tests-19
CMD: svn co --username apache --password jandom
http://192.168.49.21/repositories/commit_tests-19
working_copies/commit_tests-19
CMD: svn rm working_copies/commit_tests-19/A/mu
CMD: svn commit -m logmsg working_copies/commit_tests-19/A/mu
PASS: commit_tests.py 19: commit deleted (and missing) file
CMD: svnadmin create repositories/commit_tests-20
CMD: svnadmin dump local_tmp/repos | svnadmin load
repositories/commit_tests-20
CMD: svn co --username apache --password jandom
http://192.168.49.21/repositories/commit_tests-20
working_copies/commit_tests-20
CMD: svn add working_copies/commit_tests-20/A/D/H/gloo
CMD: svn ci -m log msg working_copies/commit_tests-20
CMD: svn status -v -u -q working_copies/commit_tests-20
CMD: svn up -r 1 working_copies/commit_tests-20
CMD: svn add working_copies/commit_tests-20/A/D/H/gloo
CMD: svn ci -m log msg working_copies/commit_tests-20
PASS: commit_tests.py 20: issue 644 attempt to add a file twice
CMD: svnadmin create repositories/commit_tests-21
CMD: svnadmin dump local_tmp/repos | svnadmin load
repositories/commit_tests-21
CMD: svn co --username apache --password jandom
http://192.168.49.21/repositories/commit_tests-21
working_copies/commit_tests-21
CMD: svn ci -m log msg
/usr/local/src/svn_new/subversion/tests/clients/cmdline/working_copies/commit_t
ests-21
PASS: commit_tests.py 21: commit from a dir with a longer name than the wc
CMD: svnadmin create repositories/commit_tests-22
CMD: svnadmin dump local_tmp/repos | svnadmin load
repositories/commit_tests-22
CMD: svn co --username apache --password jandom
http://192.168.49.21/repositories/commit_tests-22
working_copies/commit_tests-22
CMD: svn ci -m log msg working_copies/commit_tests-22
CMD: svn cleanup working_copies/commit_tests-22/A/D
CMD: svn ci -m log msg working_copies/commit_tests-22
CMD: svn status -v -u -q working_copies/commit_tests-22
PASS: commit_tests.py 22: try to commit when directory is locked
CMD: svnadmin create repositories/commit_tests-23
CMD: svnadmin dump local_tmp/repos | svnadmin load
repositories/commit_tests-23
CMD: svn co --username apache --password jandom
http://192.168.49.21/repositories/commit_tests-23
working_copies/commit_tests-23
CMD: svn propset pname pval working_copies/commit_tests-23
CMD: svn ci -m log msg .
CMD: svn status -v -u -q working_copies/commit_tests-23
PASS: commit_tests.py 23: commit the current directory
CMD: svnadmin create repositories/commit_tests-24
CMD: svnadmin dump local_tmp/repos | svnadmin load
repositories/commit_tests-24
CMD: svn co --username apache --password jandom
http://192.168.49.21/repositories/commit_tests-24
working_copies/commit_tests-24
CMD: svn checkout --username apache --password jandom
http://192.168.49.21/repositories/commit_tests-24
working_copies/commit_tests-24/A/wc2
CMD: svn status -v -u -q working_copies/commit_tests-24
CMD: svn status -v -u -q working_copies/commit_tests-24/A/wc2
CMD: svn commit -m log working_copies/commit_tests-24
working_copies/commit_tests-24/A/wc2
CMD: svn status -v -u -q working_copies/commit_tests-24
CMD: svn status -v -u -q working_copies/commit_tests-24/A/wc2
PASS: commit_tests.py 24: attempted commit from multiple wc fails
CMD: svnadmin create repositories/commit_tests-25
CMD: svnadmin dump local_tmp/repos | svnadmin load
repositories/commit_tests-25
CMD: svn co --username apache --password jandom
http://192.168.49.21/repositories/commit_tests-25
working_copies/commit_tests-25
CMD: svn commit -m log working_copies/commit_tests-25
CMD: svn commit -m log working_copies/commit_tests-25.other
CMD: svnadmin lstxns repositories/commit_tests-25
Output of 'svnadmin lstxns' is unexpected.
EXPECTED STDOUT:
ACTUAL STDOUT:
3
XFAIL: commit_tests.py 25: commit with conflicts and check txn in repo
CMD: svnadmin create repositories/commit_tests-26
CMD: svnadmin dump local_tmp/repos | svnadmin load
repositories/commit_tests-26
CMD: svn co --username apache --password jandom
http://192.168.49.21/repositories/commit_tests-26
working_copies/commit_tests-26
CMD: svn add working_copies/commit_tests-26/newfile
CMD: svn ci -m log msg working_copies/commit_tests-26
PASS: commit_tests.py 26: committing a symlink should fail
CMD: svnadmin create repositories/commit_tests-27
CMD: svnadmin dump local_tmp/repos | svnadmin load
repositories/commit_tests-27
CMD: svn co --username apache --password jandom
http://192.168.49.21/repositories/commit_tests-27
working_copies/commit_tests-27
CMD: svn propset fooprop foopropval working_copies/commit_tests-27/A/C
CMD: svn ci -m log msg working_copies/commit_tests-27
CMD: svn status -v -u -q working_copies/commit_tests-27
CMD: svn rm working_copies/commit_tests-27backup/A/D/H/omega
working_copies/commit_tests-27backup/A/C
CMD: svn commit -m blah
working_copies/commit_tests-27backup/A/D/H/omega
CMD: svn commit -m blah working_copies/commit_tests-27backup/A/C
PASS: commit_tests.py 27: commit deletion of out-of-date file or dir.
END: commit_tests.py

START: update_tests.py
CMD: svnadmin create local_tmp/repos
CMD: svn import --username apache --password jandom -m Log
message for revision 1. http://192.168.49.21/local_tmp/repos
local_tmp/greekfiles
CMD: svnadmin create repositories/update_tests-1
CMD: svnadmin dump local_tmp/repos | svnadmin load
repositories/update_tests-1
CMD: svn co --username apache --password jandom
http://192.168.49.21/repositories/update_tests-1
working_copies/update_tests-1
CMD: svn add working_copies/update_tests-1/A/theta
CMD: svn ci -m log msg working_copies/update_tests-1
CMD: svn status -v -u -q working_copies/update_tests-1
CMD: svn ci -m log msg working_copies/update_tests-1
CMD: svn status -v -u -q working_copies/update_tests-1
CMD: svn up working_copies/update_tests-1backup
CMD: svn proplist working_copies/update_tests-1backup --verbose
CMD: svn proplist working_copies/update_tests-1backup/iota --verbose
CMD: svn proplist working_copies/update_tests-1backup/A --verbose
CMD: svn proplist working_copies/update_tests-1backup/A/mu --verbose
CMD: svn proplist working_copies/update_tests-1backup/A/theta --verbose
CMD: svn proplist working_copies/update_tests-1backup/A/theta.r2
--verbose
CMD: svn proplist working_copies/update_tests-1backup/A/theta.r3
--verbose
CMD: svn proplist working_copies/update_tests-1backup/A/D --verbose
CMD: svn proplist working_copies/update_tests-1backup/A/D/gamma --verbose
CMD: svn proplist working_copies/update_tests-1backup/A/D/H --verbose
CMD: svn proplist working_copies/update_tests-1backup/A/D/H/omega
--verbose
CMD: svn proplist working_copies/update_tests-1backup/A/D/H/psi --verbose
CMD: svn proplist working_copies/update_tests-1backup/A/D/H/chi --verbose
CMD: svn proplist working_copies/update_tests-1backup/A/D/G --verbose
CMD: svn proplist working_copies/update_tests-1backup/A/D/G/tau --verbose
CMD: svn proplist working_copies/update_tests-1backup/A/D/G/rho --verbose
CMD: svn proplist working_copies/update_tests-1backup/A/D/G/pi --verbose
CMD: svn proplist working_copies/update_tests-1backup/A/C --verbose
CMD: svn proplist working_copies/update_tests-1backup/A/B --verbose
CMD: svn proplist working_copies/update_tests-1backup/A/B/lambda
--verbose
CMD: svn proplist working_copies/update_tests-1backup/A/B/F --verbose
CMD: svn proplist working_copies/update_tests-1backup/A/B/E --verbose
CMD: svn proplist working_copies/update_tests-1backup/A/B/E/alpha
--verbose
CMD: svn proplist working_copies/update_tests-1backup/A/B/E/beta
--verbose
CMD: svn status -v -u -q working_copies/update_tests-1backup
PASS: update_tests.py 1: update a locally-modified binary file
CMD: svnadmin create repositories/update_tests-2
CMD: svnadmin dump local_tmp/repos | svnadmin load
repositories/update_tests-2
CMD: svn co --username apache --password jandom
http://192.168.49.21/repositories/update_tests-2
working_copies/update_tests-2
CMD: svn add working_copies/update_tests-2/A/theta
working_copies/update_tests-2/A/zeta
CMD: svn ci -m log msg working_copies/update_tests-2
CMD: svn status -v -u -q working_copies/update_tests-2
CMD: svn ci -m log msg working_copies/update_tests-2
CMD: svn status -v -u -q working_copies/update_tests-2
CMD: svn up -r 2 working_copies/update_tests-2
CMD: svn proplist working_copies/update_tests-2 --verbose
CMD: svn proplist working_copies/update_tests-2/iota --verbose
CMD: svn proplist working_copies/update_tests-2/A --verbose
CMD: svn proplist working_copies/update_tests-2/A/mu --verbose
CMD: svn proplist working_copies/update_tests-2/A/theta --verbose
CMD: svn proplist working_copies/update_tests-2/A/zeta --verbose
CMD: svn proplist working_copies/update_tests-2/A/D --verbose
CMD: svn proplist working_copies/update_tests-2/A/D/gamma --verbose
CMD: svn proplist working_copies/update_tests-2/A/D/H --verbose
CMD: svn proplist working_copies/update_tests-2/A/D/H/omega --verbose
CMD: svn proplist working_copies/update_tests-2/A/D/H/psi --verbose
CMD: svn proplist working_copies/update_tests-2/A/D/H/chi --verbose
CMD: svn proplist working_copies/update_tests-2/A/D/G --verbose
CMD: svn proplist working_copies/update_tests-2/A/D/G/tau --verbose
CMD: svn proplist working_copies/update_tests-2/A/D/G/rho --verbose
CMD: svn proplist working_copies/update_tests-2/A/D/G/pi --verbose
CMD: svn proplist working_copies/update_tests-2/A/C --verbose
CMD: svn proplist working_copies/update_tests-2/A/B --verbose
CMD: svn proplist working_copies/update_tests-2/A/B/lambda --verbose
CMD: svn proplist working_copies/update_tests-2/A/B/F --verbose
CMD: svn proplist working_copies/update_tests-2/A/B/E --verbose
CMD: svn proplist working_copies/update_tests-2/A/B/E/alpha --verbose
CMD: svn proplist working_copies/update_tests-2/A/B/E/beta --verbose
CMD: svn status -v -u -q working_copies/update_tests-2
PASS: update_tests.py 2: update to an old revision of a binary files
CMD: svnadmin create repositories/update_tests-3
CMD: svnadmin dump local_tmp/repos | svnadmin load
repositories/update_tests-3
CMD: svn co --username apache --password jandom
http://192.168.49.21/repositories/update_tests-3
working_copies/update_tests-3
CMD: svn ci -m log msg working_copies/update_tests-3/A/D/G/rho
CMD: svn add working_copies/update_tests-3/A/B/zeta
CMD: svn delete working_copies/update_tests-3/A/D/gamma
CMD: svn add working_copies/update_tests-3/A/D/gamma
CMD: svn up working_copies/update_tests-3
CMD: svn status -v -u -q working_copies/update_tests-3
PASS: update_tests.py 3: ensure update is not munging additions or
replacements
CMD: svnadmin create repositories/update_tests-4
CMD: svnadmin dump local_tmp/repos | svnadmin load
repositories/update_tests-4
CMD: svn co --username apache --password jandom
http://192.168.49.21/repositories/update_tests-4
working_copies/update_tests-4
CMD: svn up -r 0 working_copies/update_tests-4
PASS: update_tests.py 4: update to revision 0
CMD: svnadmin create repositories/update_tests-5
CMD: svnadmin dump local_tmp/repos | svnadmin load
repositories/update_tests-5
CMD: svn co --username apache --password jandom
http://192.168.49.21/repositories/update_tests-5
working_copies/update_tests-5
CMD: svn ci -m log msg working_copies/update_tests-5
CMD: svn status -v -u -q working_copies/update_tests-5
CMD: svn up working_copies/update_tests-5-other
CMD: svn status -v -u -q working_copies/update_tests-5-other
PASS: update_tests.py 5: make sure overlapping identical changes do not
conflict
CMD: svnadmin create repositories/update_tests-6
CMD: svnadmin dump local_tmp/repos | svnadmin load
repositories/update_tests-6
CMD: svn co --username apache --password jandom
http://192.168.49.21/repositories/update_tests-6
working_copies/update_tests-6
CMD: svn propset Kubla Khan working_copies/update_tests-6/A/D/G/rho
CMD: svn propset Kubla Xanadu
working_copies/update_tests-6backup/A/D/G/rho
CMD: svn ci -m log msg working_copies/update_tests-6
CMD: svn status -v -u -q working_copies/update_tests-6
CMD: svn up working_copies/update_tests-6backup
CMD: svn status -v -u -q working_copies/update_tests-6backup
CMD: svn up working_copies/update_tests-6backup
CMD: svn status -v -u -q working_copies/update_tests-6backup
PASS: update_tests.py 6: delete files and update to resolve text conflicts
CMD: svnadmin create repositories/update_tests-7
CMD: svnadmin dump local_tmp/repos | svnadmin load
repositories/update_tests-7
CMD: svn co --username apache --password jandom
http://192.168.49.21/repositories/update_tests-7
working_copies/update_tests-7
CMD: svn rm working_copies/update_tests-7/A/B/E/alpha
CMD: svn rm working_copies/update_tests-7/A/D/G
CMD: svn ci -m log msg working_copies/update_tests-7
CMD: svn up working_copies/update_tests-7
CMD: svn up -r 1 working_copies/update_tests-7
CMD: svn status -v -u -q working_copies/update_tests-7
CMD: svn up working_copies/update_tests-7
CMD: svn status -v -u -q working_copies/update_tests-7
PASS: update_tests.py 7: update that deletes modifed files
CMD: svnadmin create repositories/update_tests-8
CMD: svnadmin dump local_tmp/repos | svnadmin load
repositories/update_tests-8
CMD: svn co --username apache --password jandom
http://192.168.49.21/repositories/update_tests-8
working_copies/update_tests-8
CMD: svn rm working_copies/update_tests-8/A/B/E/alpha
working_copies/update_tests-8/A/B/F
CMD: svn ci -m log msg working_copies/update_tests-8
CMD: svn status -v -u -q working_copies/update_tests-8
CMD: svn add working_copies/update_tests-8/A/B/E/alpha
CMD: svn mkdir working_copies/update_tests-8/A/B/F
CMD: svn status -v -u -q working_copies/update_tests-8
CMD: svn rm --force working_copies/update_tests-8/A/B/E/alpha
working_copies/update_tests-8/A/B/F
CMD: svn status -v -u -q working_copies/update_tests-8
CMD: svn up -r 1 working_copies/update_tests-8
CMD: svn status -v -u -q working_copies/update_tests-8
PASS: update_tests.py 8: update after add/rm of deleted state
CMD: svnadmin create repositories/update_tests-9
CMD: svnadmin dump local_tmp/repos | svnadmin load
repositories/update_tests-9
CMD: svn co --username apache --password jandom
http://192.168.49.21/repositories/update_tests-9
working_copies/update_tests-9
CMD: svn up working_copies/update_tests-9/A/mu
working_copies/update_tests-9/A/D/G/rho
working_copies/update_tests-9/A/B/E working_copies/update_tests-9/A/D/H
CMD: svn status -v -u -q working_copies/update_tests-9
PASS: update_tests.py 9: update missing items (by name) in working copy
CMD: svnadmin create repositories/update_tests-10
CMD: svnadmin dump local_tmp/repos | svnadmin load
repositories/update_tests-10
CMD: svn co --username apache --password jandom
http://192.168.49.21/repositories/update_tests-10
working_copies/update_tests-10
CMD: svn rm working_copies/update_tests-10/A/B/F
CMD: svn ci -m log msg working_copies/update_tests-10
CMD: svn status -v -u -q working_copies/update_tests-10
CMD: svn mkdir working_copies/update_tests-10/A/B/F
CMD: svn ci -m log msg working_copies/update_tests-10
CMD: svn status -v -u -q working_copies/update_tests-10
CMD: svn up working_copies/update_tests-10
CMD: svn status -v -u -q working_copies/update_tests-10
CMD: svn up -r 1 working_copies/update_tests-10
CMD: svn status -v -u -q working_copies/update_tests-10
PASS: update_tests.py 10: update that replaces a directory
CMD: svnadmin create repositories/update_tests-11
CMD: svnadmin dump local_tmp/repos | svnadmin load
repositories/update_tests-11
CMD: svn co --username apache --password jandom
http://192.168.49.21/repositories/update_tests-11
working_copies/update_tests-11
CMD: svn ci -m log msg working_copies/update_tests-11
CMD: svn status -v -u -q working_copies/update_tests-11
CMD: svn up -r 1 mu
CMD: svn status -v -u -q working_copies/update_tests-11
PASS: update_tests.py 11: update with explict file target
CMD: svnadmin create repositories/update_tests-12
CMD: svnadmin dump local_tmp/repos | svnadmin load
repositories/update_tests-12
CMD: svn co --username apache --password jandom
http://192.168.49.21/repositories/update_tests-12
working_copies/update_tests-12
CMD: svn mkdir -m log msg
http://192.168.49.21/repositories/update_tests-12/A/D/G/.svn
CMD: svn up working_copies/update_tests-12
PASS: update_tests.py 12: bail when receive a file or dir named .svn
END: update_tests.py

START: switch_tests.py
CMD: svnadmin create local_tmp/repos
CMD: svn import --username apache --password jandom -m Log
message for revision 1. http://192.168.49.21/local_tmp/repos
local_tmp/greekfiles
CMD: svnadmin create repositories/switch_tests-1
CMD: svnadmin dump local_tmp/repos | svnadmin load
repositories/switch_tests-1
CMD: svn co --username apache --password jandom
http://192.168.49.21/repositories/switch_tests-1
working_copies/switch_tests-1
CMD: svn switch --username apache --password jandom
http://192.168.49.21/repositories/switch_tests-1/A/D/gamma
working_copies/switch_tests-1/iota
CMD: svn status -v -u -q working_copies/switch_tests-1
CMD: svn switch --username apache --password jandom
http://192.168.49.21/repositories/switch_tests-1/A/D/G
working_copies/switch_tests-1/A/B
CMD: svn status -v -u -q working_copies/switch_tests-1
PASS: switch_tests.py 1: test some basic switching operations
CMD: svnadmin create repositories/switch_tests-2
CMD: svnadmin dump local_tmp/repos | svnadmin load
repositories/switch_tests-2
CMD: svn co --username apache --password jandom
http://192.168.49.21/repositories/switch_tests-2
working_copies/switch_tests-2
CMD: svn switch --username apache --password jandom
http://192.168.49.21/repositories/switch_tests-2/A/D/gamma
working_copies/switch_tests-2/iota
CMD: svn switch http://192.168.49.21/repositories/switch_tests-2/A/D/G
working_copies/switch_tests-2/A/B
CMD: svn add working_copies/switch_tests-2/A/D/G/Z
CMD: svn ci -m log msg working_copies/switch_tests-2
CMD: svn revert working_copies/switch_tests-2/A/D/G/pi
CMD: svn ci -m log msg working_copies/switch_tests-2
CMD: svn status -v -u -q working_copies/switch_tests-2
PASS: switch_tests.py 2: commits after some basic switching operations
CMD: svnadmin create repositories/switch_tests-3
CMD: svnadmin dump local_tmp/repos | svnadmin load
repositories/switch_tests-3
CMD: svn co --username apache --password jandom
http://192.168.49.21/repositories/switch_tests-3
working_copies/switch_tests-3
CMD: svn switch --username apache --password jandom
http://192.168.49.21/repositories/switch_tests-3/A/D/gamma
working_copies/switch_tests-3/iota
CMD: svn switch http://192.168.49.21/repositories/switch_tests-3/A/D/G
working_copies/switch_tests-3/A/B
CMD: svn add working_copies/switch_tests-3backup/A/D/G/Z
CMD: svn ci -m log msg working_copies/switch_tests-3backup
CMD: svn revert working_copies/switch_tests-3backup/A/D/G/pi
CMD: svn ci -m log msg working_copies/switch_tests-3backup
CMD: svn up working_copies/switch_tests-3
CMD: svn status -v -u -q working_copies/switch_tests-3
PASS: switch_tests.py 3: update wc that contains switched things
CMD: svnadmin create repositories/switch_tests-4
CMD: svnadmin dump local_tmp/repos | svnadmin load
repositories/switch_tests-4
CMD: svn co --username apache --password jandom
http://192.168.49.21/repositories/switch_tests-4
working_copies/switch_tests-4
CMD: svn switch --username apache --password jandom
http://192.168.49.21/repositories/switch_tests-4/A/D/gamma
working_copies/switch_tests-4/iota
CMD: svn switch http://192.168.49.21/repositories/switch_tests-4/A/D/G
working_copies/switch_tests-4/A/B
CMD: svn add working_copies/switch_tests-4/A/D/G/Z
CMD: svn ci -m log msg working_copies/switch_tests-4
CMD: svn revert working_copies/switch_tests-4/A/D/G/pi
CMD: svn ci -m log msg working_copies/switch_tests-4
CMD: svn up working_copies/switch_tests-4
CMD: svn up -r 1 working_copies/switch_tests-4
CMD: svn proplist working_copies/switch_tests-4 --verbose
CMD: svn proplist working_copies/switch_tests-4/iota --verbose
CMD: svn proplist working_copies/switch_tests-4/A --verbose
CMD: svn proplist working_copies/switch_tests-4/A/mu --verbose
CMD: svn proplist working_copies/switch_tests-4/A/D --verbose
CMD: svn proplist working_copies/switch_tests-4/A/D/gamma --verbose
CMD: svn proplist working_copies/switch_tests-4/A/D/G --verbose
CMD: svn proplist working_copies/switch_tests-4/A/D/G/tau --verbose
CMD: svn proplist working_copies/switch_tests-4/A/D/G/rho --verbose
CMD: svn proplist working_copies/switch_tests-4/A/D/G/pi --verbose
CMD: svn proplist working_copies/switch_tests-4/A/D/H --verbose
CMD: svn proplist working_copies/switch_tests-4/A/D/H/omega --verbose
CMD: svn proplist working_copies/switch_tests-4/A/D/H/psi --verbose
CMD: svn proplist working_copies/switch_tests-4/A/D/H/chi --verbose
CMD: svn proplist working_copies/switch_tests-4/A/C --verbose
CMD: svn proplist working_copies/switch_tests-4/A/B --verbose
CMD: svn proplist working_copies/switch_tests-4/A/B/rho --verbose
CMD: svn proplist working_copies/switch_tests-4/A/B/pi --verbose
CMD: svn proplist working_copies/switch_tests-4/A/B/tau --verbose
CMD: svn status -v -u -q working_copies/switch_tests-4
PASS: switch_tests.py 4: reverse update wc that contains switched things
CMD: svnadmin create repositories/switch_tests-5
CMD: svnadmin dump local_tmp/repos | svnadmin load
repositories/switch_tests-5
CMD: svn co --username apache --password jandom
http://192.168.49.21/repositories/switch_tests-5
working_copies/switch_tests-5
CMD: svn switch --username apache --password jandom
http://192.168.49.21/repositories/switch_tests-5/A/D/gamma
working_copies/switch_tests-5/iota
CMD: svn switch http://192.168.49.21/repositories/switch_tests-5/A/D/G
working_copies/switch_tests-5/A/B
CMD: svn add working_copies/switch_tests-5backup/A/D/G/Z
CMD: svn ci -m log msg working_copies/switch_tests-5backup
CMD: svn revert working_copies/switch_tests-5backup/A/D/G/pi
CMD: svn ci -m log msg working_copies/switch_tests-5backup
CMD: svn up working_copies/switch_tests-5/A/B
working_copies/switch_tests-5/iota
CMD: svn status -v -u -q working_copies/switch_tests-5
PASS: switch_tests.py 5: update switched wc things to HEAD
CMD: svnadmin create repositories/switch_tests-6
CMD: svnadmin dump local_tmp/repos | svnadmin load
repositories/switch_tests-6
CMD: svn co --username apache --password jandom
http://192.168.49.21/repositories/switch_tests-6
working_copies/switch_tests-6
CMD: svn switch --username apache --password jandom
http://192.168.49.21/repositories/switch_tests-6/A/D/gamma
working_copies/switch_tests-6/iota
CMD: svn switch http://192.168.49.21/repositories/switch_tests-6/A/D/G
working_copies/switch_tests-6/A/B
CMD: svn add working_copies/switch_tests-6/A/D/G/Z
CMD: svn ci -m log msg working_copies/switch_tests-6
CMD: svn revert working_copies/switch_tests-6/A/D/G/pi
CMD: svn ci -m log msg working_copies/switch_tests-6
CMD: svn up working_copies/switch_tests-6
CMD: svn up -r 1 working_copies/switch_tests-6/A/B
working_copies/switch_tests-6/iota
CMD: svn proplist working_copies/switch_tests-6 --verbose
CMD: svn proplist working_copies/switch_tests-6/iota --verbose
CMD: svn proplist working_copies/switch_tests-6/A --verbose
CMD: svn proplist working_copies/switch_tests-6/A/mu --verbose
CMD: svn proplist working_copies/switch_tests-6/A/D --verbose
CMD: svn proplist working_copies/switch_tests-6/A/D/gamma --verbose
CMD: svn proplist working_copies/switch_tests-6/A/D/H --verbose
CMD: svn proplist working_copies/switch_tests-6/A/D/H/omega --verbose
CMD: svn proplist working_copies/switch_tests-6/A/D/H/psi --verbose
CMD: svn proplist working_copies/switch_tests-6/A/D/H/chi --verbose
CMD: svn proplist working_copies/switch_tests-6/A/D/G --verbose
CMD: svn proplist working_copies/switch_tests-6/A/D/G/tau --verbose
CMD: svn proplist working_copies/switch_tests-6/A/D/G/rho --verbose
CMD: svn proplist working_copies/switch_tests-6/A/D/G/pi --verbose
CMD: svn proplist working_copies/switch_tests-6/A/D/G/Z --verbose
CMD: svn proplist working_copies/switch_tests-6/A/D/G/Z/zeta --verbose
CMD: svn proplist working_copies/switch_tests-6/A/C --verbose
CMD: svn proplist working_copies/switch_tests-6/A/B --verbose
CMD: svn proplist working_copies/switch_tests-6/A/B/rho --verbose
CMD: svn proplist working_copies/switch_tests-6/A/B/pi --verbose
CMD: svn proplist working_copies/switch_tests-6/A/B/tau --verbose
CMD: svn status -v -u -q working_copies/switch_tests-6
PASS: switch_tests.py 6: reverse update switched wc things to an older rev
END: switch_tests.py

START: prop_tests.py
CMD: svnadmin create local_tmp/repos
CMD: svn import --username apache --password jandom -m Log
message for revision 1. http://192.168.49.21/local_tmp/repos
local_tmp/greekfiles
CMD: svnadmin create repositories/prop_tests-1
CMD: svnadmin dump local_tmp/repos | svnadmin load
repositories/prop_tests-1
CMD: svn co --username apache --password jandom
http://192.168.49.21/repositories/prop_tests-1
working_copies/prop_tests-1
CMD: svn propset blue azul working_copies/prop_tests-1/A/mu
CMD: svn propset green verde working_copies/prop_tests-1/A/mu
CMD: svn propset red rojo working_copies/prop_tests-1/A/D/G
CMD: svn propset yellow amarillo working_copies/prop_tests-1/A/D/G
CMD: svn status -v -u -q working_copies/prop_tests-1
CMD: svn propdel yellow working_copies/prop_tests-1/A/D/G
CMD: svn proplist working_copies/prop_tests-1 --verbose
CMD: svn proplist working_copies/prop_tests-1/iota --verbose
CMD: svn proplist working_copies/prop_tests-1/A --verbose
CMD: svn proplist working_copies/prop_tests-1/A/mu --verbose
CMD: svn proplist working_copies/prop_tests-1/A/D --verbose
CMD: svn proplist working_copies/prop_tests-1/A/D/gamma --verbose
CMD: svn proplist working_copies/prop_tests-1/A/D/H --verbose
CMD: svn proplist working_copies/prop_tests-1/A/D/H/omega --verbose
CMD: svn proplist working_copies/prop_tests-1/A/D/H/chi --verbose
CMD: svn proplist working_copies/prop_tests-1/A/D/H/psi --verbose
CMD: svn proplist working_copies/prop_tests-1/A/D/G --verbose
CMD: svn proplist working_copies/prop_tests-1/A/D/G/tau --verbose
CMD: svn proplist working_copies/prop_tests-1/A/D/G/rho --verbose
CMD: svn proplist working_copies/prop_tests-1/A/D/G/pi --verbose
CMD: svn proplist working_copies/prop_tests-1/A/C --verbose
CMD: svn proplist working_copies/prop_tests-1/A/B --verbose
CMD: svn proplist working_copies/prop_tests-1/A/B/lambda --verbose
CMD: svn proplist working_copies/prop_tests-1/A/B/F --verbose
CMD: svn proplist working_copies/prop_tests-1/A/B/E --verbose
CMD: svn proplist working_copies/prop_tests-1/A/B/E/alpha --verbose
CMD: svn proplist working_copies/prop_tests-1/A/B/E/beta --verbose
PASS: prop_tests.py 1: write/read props in wc only (ps, pl, pdel)
CMD: svnadmin create repositories/prop_tests-2
CMD: svnadmin dump local_tmp/repos | svnadmin load
repositories/prop_tests-2
CMD: svn co --username apache --password jandom
http://192.168.49.21/repositories/prop_tests-2
working_copies/prop_tests-2
CMD: svn propset blue azul working_copies/prop_tests-2/A/mu
CMD: svn propset red rojo working_copies/prop_tests-2/A/D/H
CMD: svn ci -m log msg working_copies/prop_tests-2
CMD: svn status -v -u -q working_copies/prop_tests-2
PASS: prop_tests.py 2: commit properties
CMD: svnadmin create repositories/prop_tests-3
CMD: svnadmin dump local_tmp/repos | svnadmin load
repositories/prop_tests-3
CMD: svn co --username apache --password jandom
http://192.168.49.21/repositories/prop_tests-3
working_copies/prop_tests-3
CMD: svn propset blue azul working_copies/prop_tests-3/A/mu
CMD: svn propset red rojo working_copies/prop_tests-3/A/D/H
CMD: svn ci -m log msg working_copies/prop_tests-3
CMD: svn status -v -u -q working_copies/prop_tests-3
CMD: svn up working_copies/prop_tests-3backup
CMD: svn proplist working_copies/prop_tests-3backup --verbose
CMD: svn proplist working_copies/prop_tests-3backup/iota --verbose
CMD: svn proplist working_copies/prop_tests-3backup/A --verbose
CMD: svn proplist working_copies/prop_tests-3backup/A/mu --verbose
CMD: svn proplist working_copies/prop_tests-3backup/A/D --verbose
CMD: svn proplist working_copies/prop_tests-3backup/A/D/gamma --verbose
CMD: svn proplist working_copies/prop_tests-3backup/A/D/H --verbose
CMD: svn proplist working_copies/prop_tests-3backup/A/D/H/omega --verbose
CMD: svn proplist working_copies/prop_tests-3backup/A/D/H/psi --verbose
CMD: svn proplist working_copies/prop_tests-3backup/A/D/H/chi --verbose
CMD: svn proplist working_copies/prop_tests-3backup/A/D/G --verbose
CMD: svn proplist working_copies/prop_tests-3backup/A/D/G/tau --verbose
CMD: svn proplist working_copies/prop_tests-3backup/A/D/G/rho --verbose
CMD: svn proplist working_copies/prop_tests-3backup/A/D/G/pi --verbose
CMD: svn proplist working_copies/prop_tests-3backup/A/C --verbose
CMD: svn proplist working_copies/prop_tests-3backup/A/B --verbose
CMD: svn proplist working_copies/prop_tests-3backup/A/B/lambda --verbose
CMD: svn proplist working_copies/prop_tests-3backup/A/B/F --verbose
CMD: svn proplist working_copies/prop_tests-3backup/A/B/E --verbose
CMD: svn proplist working_copies/prop_tests-3backup/A/B/E/alpha --verbose
CMD: svn proplist working_copies/prop_tests-3backup/A/B/E/beta --verbose
CMD: svn status -v -u -q working_copies/prop_tests-3backup
PASS: prop_tests.py 3: receive properties via update
CMD: svnadmin create repositories/prop_tests-4
CMD: svnadmin dump local_tmp/repos | svnadmin load
repositories/prop_tests-4
CMD: svn co --username apache --password jandom
http://192.168.49.21/repositories/prop_tests-4
working_copies/prop_tests-4
CMD: svn propset cash-sound cha-ching! working_copies/prop_tests-4/iota
CMD: svn ci -m log msg working_copies/prop_tests-4
CMD: svn status -v -u -q working_copies/prop_tests-4
CMD: svn ci -m log msg working_copies/prop_tests-4
CMD: svn status -v -u -q working_copies/prop_tests-4
CMD: svn up -r 1 working_copies/prop_tests-4
CMD: svn proplist working_copies/prop_tests-4 --verbose
CMD: svn proplist working_copies/prop_tests-4/iota --verbose
CMD: svn proplist working_copies/prop_tests-4/A --verbose
CMD: svn proplist working_copies/prop_tests-4/A/mu --verbose
CMD: svn proplist working_copies/prop_tests-4/A/D --verbose
CMD: svn proplist working_copies/prop_tests-4/A/D/gamma --verbose
CMD: svn proplist working_copies/prop_tests-4/A/D/H --verbose
CMD: svn proplist working_copies/prop_tests-4/A/D/H/omega --verbose
CMD: svn proplist working_copies/prop_tests-4/A/D/H/psi --verbose
CMD: svn proplist working_copies/prop_tests-4/A/D/H/chi --verbose
CMD: svn proplist working_copies/prop_tests-4/A/D/G --verbose
CMD: svn proplist working_copies/prop_tests-4/A/D/G/tau --verbose
CMD: svn proplist working_copies/prop_tests-4/A/D/G/rho --verbose
CMD: svn proplist working_copies/prop_tests-4/A/D/G/pi --verbose
CMD: svn proplist working_copies/prop_tests-4/A/C --verbose
CMD: svn proplist working_copies/prop_tests-4/A/B --verbose
CMD: svn proplist working_copies/prop_tests-4/A/B/lambda --verbose
CMD: svn proplist working_copies/prop_tests-4/A/B/F --verbose
CMD: svn proplist working_copies/prop_tests-4/A/B/E --verbose
CMD: svn proplist working_copies/prop_tests-4/A/B/E/alpha --verbose
CMD: svn proplist working_copies/prop_tests-4/A/B/E/beta --verbose
CMD: svn status -v -u -q working_copies/prop_tests-4
PASS: prop_tests.py 4: receive property changes as part of a downdate
CMD: svnadmin create repositories/prop_tests-5
CMD: svnadmin dump local_tmp/repos | svnadmin load
repositories/prop_tests-5
CMD: svn co --username apache --password jandom
http://192.168.49.21/repositories/prop_tests-5
working_copies/prop_tests-5
CMD: svn propset cash-sound cha-ching! working_copies/prop_tests-5/iota
CMD: svn ci -m logmsg working_copies/prop_tests-5/iota
CMD: svn propdel cash-sound working_copies/prop_tests-5/iota
CMD: svn ci -m log msg working_copies/prop_tests-5
CMD: svn status -v -u -q working_copies/prop_tests-5
PASS: prop_tests.py 5: commit the removal of props
CMD: svnadmin create repositories/prop_tests-6
CMD: svnadmin dump local_tmp/repos | svnadmin load
repositories/prop_tests-6
CMD: svn co --username apache --password jandom
http://192.168.49.21/repositories/prop_tests-6
working_copies/prop_tests-6
CMD: svn propset cash-sound cha-ching! working_copies/prop_tests-6/A/mu
CMD: svn propset foo bar working_copies/prop_tests-6/A
CMD: svn ci -m logmsg working_copies/prop_tests-6
CMD: svn up -r 1 working_copies/prop_tests-6
CMD: svn propset cash-sound beep! working_copies/prop_tests-6/A/mu
CMD: svn propset foo baz working_copies/prop_tests-6/A
CMD: svn up working_copies/prop_tests-6
CMD: svn proplist working_copies/prop_tests-6 --verbose
CMD: svn proplist working_copies/prop_tests-6/iota --verbose
CMD: svn proplist working_copies/prop_tests-6/A --verbose
CMD: svn proplist working_copies/prop_tests-6/A/mu --verbose
CMD: svn proplist working_copies/prop_tests-6/A/mu.prej --verbose
CMD: svn proplist working_copies/prop_tests-6/A/dir_conflicts.prej
--verbose
CMD: svn proplist working_copies/prop_tests-6/A/D --verbose
CMD: svn proplist working_copies/prop_tests-6/A/D/gamma --verbose
CMD: svn proplist working_copies/prop_tests-6/A/D/H --verbose
CMD: svn proplist working_copies/prop_tests-6/A/D/H/omega --verbose
CMD: svn proplist working_copies/prop_tests-6/A/D/H/psi --verbose
CMD: svn proplist working_copies/prop_tests-6/A/D/H/chi --verbose
CMD: svn proplist working_copies/prop_tests-6/A/D/G --verbose
CMD: svn proplist working_copies/prop_tests-6/A/D/G/tau --verbose
CMD: svn proplist working_copies/prop_tests-6/A/D/G/rho --verbose
CMD: svn proplist working_copies/prop_tests-6/A/D/G/pi --verbose
CMD: svn proplist working_copies/prop_tests-6/A/C --verbose
CMD: svn proplist working_copies/prop_tests-6/A/B --verbose
CMD: svn proplist working_copies/prop_tests-6/A/B/lambda --verbose
CMD: svn proplist working_copies/prop_tests-6/A/B/F --verbose
CMD: svn proplist working_copies/prop_tests-6/A/B/E --verbose
CMD: svn proplist working_copies/prop_tests-6/A/B/E/alpha --verbose
CMD: svn proplist working_copies/prop_tests-6/A/B/E/beta --verbose
CMD: svn status -v -u -q working_copies/prop_tests-6
CMD: svn resolve working_copies/prop_tests-6/A/mu
CMD: svn resolve working_copies/prop_tests-6/A
CMD: svn status -v -u -q working_copies/prop_tests-6
PASS: prop_tests.py 6: update with conflicting props
CMD: svnadmin create repositories/prop_tests-7
CMD: svnadmin dump local_tmp/repos | svnadmin load
repositories/prop_tests-7
CMD: svn co --username apache --password jandom
http://192.168.49.21/repositories/prop_tests-7
working_copies/prop_tests-7
CMD: svn propset cash-sound cha-ching! working_copies/prop_tests-7/iota
CMD: svn propset boson W working_copies/prop_tests-7/A/B/lambda
CMD: svn ci -m logmsg working_copies/prop_tests-7
CMD: svn rm working_copies/prop_tests-7/iota
working_copies/prop_tests-7/A/B/lambda
CMD: svn add working_copies/prop_tests-7/iota
working_copies/prop_tests-7/A/B/lambda
CMD: svn status -v -u -q working_copies/prop_tests-7
CMD: svn propset capacitor flux working_copies/prop_tests-7/A/B/lambda
CMD: svn ci -m log msg working_copies/prop_tests-7
CMD: svn status -v -u -q working_copies/prop_tests-7
PASS: prop_tests.py 7: props work when committing a replacement
CMD: svnadmin create repositories/prop_tests-8
CMD: svnadmin dump local_tmp/repos | svnadmin load
repositories/prop_tests-8
CMD: svn co --username apache --password jandom
http://192.168.49.21/repositories/prop_tests-8
working_copies/prop_tests-8
CMD: svn propset cash-sound cha-ching! working_copies/prop_tests-8/iota
CMD: svn propset boson W working_copies/prop_tests-8/A/B/lambda
CMD: svn ci -m logmsg working_copies/prop_tests-8
CMD: svn rm working_copies/prop_tests-8/iota
working_copies/prop_tests-8/A/B/lambda
CMD: svn add working_copies/prop_tests-8/iota
working_copies/prop_tests-8/A/B/lambda
CMD: svn status -v -u -q working_copies/prop_tests-8
CMD: svn propset capacitor flux working_copies/prop_tests-8/A/B/lambda
CMD: svn revert working_copies/prop_tests-8/iota
working_copies/prop_tests-8/A/B/lambda
CMD: svn up working_copies/prop_tests-8
CMD: svn proplist working_copies/prop_tests-8 --verbose
CMD: svn proplist working_copies/prop_tests-8/iota --verbose
CMD: svn proplist working_copies/prop_tests-8/A --verbose
CMD: svn proplist working_copies/prop_tests-8/A/mu --verbose
CMD: svn proplist working_copies/prop_tests-8/A/D --verbose
CMD: svn proplist working_copies/prop_tests-8/A/D/gamma --verbose
CMD: svn proplist working_copies/prop_tests-8/A/D/H --verbose
CMD: svn proplist working_copies/prop_tests-8/A/D/H/omega --verbose
CMD: svn proplist working_copies/prop_tests-8/A/D/H/psi --verbose
CMD: svn proplist working_copies/prop_tests-8/A/D/H/chi --verbose
CMD: svn proplist working_copies/prop_tests-8/A/D/G --verbose
CMD: svn proplist working_copies/prop_tests-8/A/D/G/tau --verbose
CMD: svn proplist working_copies/prop_tests-8/A/D/G/rho --verbose
CMD: svn proplist working_copies/prop_tests-8/A/D/G/pi --verbose
CMD: svn proplist working_copies/prop_tests-8/A/C --verbose
CMD: svn proplist working_copies/prop_tests-8/A/B --verbose
CMD: svn proplist working_copies/prop_tests-8/A/B/lambda --verbose
CMD: svn proplist working_copies/prop_tests-8/A/B/F --verbose
CMD: svn proplist working_copies/prop_tests-8/A/B/E --verbose
CMD: svn proplist working_copies/prop_tests-8/A/B/E/alpha --verbose
CMD: svn proplist working_copies/prop_tests-8/A/B/E/beta --verbose
CMD: svn status -v -u -q working_copies/prop_tests-8
PASS: prop_tests.py 8: props work when reverting a replacement
CMD: svnadmin create repositories/prop_tests-9
CMD: svnadmin dump local_tmp/repos | svnadmin load
repositories/prop_tests-9
CMD: svn co --username apache --password jandom
http://192.168.49.21/repositories/prop_tests-9
working_copies/prop_tests-9
CMD: svn status -v -u -q working_copies/prop_tests-9
CMD: svn propset svn:executable on working_copies/prop_tests-9/A
CMD: svn propset svn:keywords LastChangedDate
working_copies/prop_tests-9/A
CMD: svn propset svn:eol-style native working_copies/prop_tests-9/A
CMD: svn propset svn:mime-type image/png working_copies/prop_tests-9/A
CMD: svn propset svn:ignore *.o working_copies/prop_tests-9/iota
CMD: svn propset svn:externals foo http://host.com/repos
working_copies/prop_tests-9/iota
CMD: svn status -v -u -q working_copies/prop_tests-9
CMD: svn propset -R svn:executable on
working_copies/prop_tests-9/A/B/E
CMD: svn status -v -u -q working_copies/prop_tests-9
CMD: svn add working_copies/prop_tests-9/binary
CMD: svn propset svn:mime-type application/octet-stream
working_copies/prop_tests-9/binary
CMD: svn propset svn:eol-style CRLF working_copies/prop_tests-9/binary
CMD: svn add working_copies/prop_tests-9/multi-eol
CMD: svn propset svn:eol-style LF working_copies/prop_tests-9/multi-eol
CMD: svn add working_copies/prop_tests-9/backwards-eol
CMD: svn propset svn:eol-style native
working_copies/prop_tests-9/backwards-eol
CMD: svn add working_copies/prop_tests-9/incomplete-eol
CMD: svn propset svn:eol-style CR
working_copies/prop_tests-9/incomplete-eol
PASS: prop_tests.py 9: try to set inappropriate props
CMD: svnadmin create repositories/prop_tests-10
CMD: svnadmin dump local_tmp/repos | svnadmin load
repositories/prop_tests-10
CMD: svn co --username apache --password jandom
http://192.168.49.21/repositories/prop_tests-10
working_copies/prop_tests-10
CMD: svn add working_copies/prop_tests-10/new_file1.bin
CMD: svn propset svn:mime-type image/fake_image
working_copies/prop_tests-10/new_file1.bin
CMD: svn propset svn:executable on
working_copies/prop_tests-10/new_file1.bin
CMD: svn ci -m create file and set svn:mime-type
working_copies/prop_tests-10
CMD: svn cp working_copies/prop_tests-10/new_file1.bin
working_copies/prop_tests-10/new_file2.bin
CMD: svn pg svn:mime-type working_copies/prop_tests-10/new_file2.bin
CMD: svn pg svn:executable working_copies/prop_tests-10/new_file2.bin
PASS: prop_tests.py 10: copying a file should use the original
svn:executable and svn:mime-type
END: prop_tests.py

START: schedule_tests.py
CMD: svnadmin create local_tmp/repos
CMD: svn import --username apache --password jandom -m Log
message for revision 1. http://192.168.49.21/local_tmp/repos
local_tmp/greekfiles
CMD: svnadmin create repositories/schedule_tests-1
CMD: svnadmin dump local_tmp/repos | svnadmin load
repositories/schedule_tests-1
CMD: svn co --username apache --password jandom
http://192.168.49.21/repositories/schedule_tests-1
working_copies/schedule_tests-1
CMD: svn add working_copies/schedule_tests-1/delta
working_copies/schedule_tests-1/A/B/zeta
working_copies/schedule_tests-1/A/D/G/epsilon
CMD: svn status -v -u -q working_copies/schedule_tests-1
PASS: schedule_tests.py 1: schedule: add some files
CMD: svnadmin create repositories/schedule_tests-2
CMD: svnadmin dump local_tmp/repos | svnadmin load
repositories/schedule_tests-2
CMD: svn co --username apache --password jandom
http://192.168.49.21/repositories/schedule_tests-2
working_copies/schedule_tests-2
CMD: svn add working_copies/schedule_tests-2/X
working_copies/schedule_tests-2/A/C/Y
working_copies/schedule_tests-2/A/D/H/Z
CMD: svn status -v -u -q working_copies/schedule_tests-2
PASS: schedule_tests.py 2: schedule: add some directories
CMD: svnadmin create repositories/schedule_tests-3
CMD: svnadmin dump local_tmp/repos | svnadmin load
repositories/schedule_tests-3
CMD: svn co --username apache --password jandom
http://192.168.49.21/repositories/schedule_tests-3
working_copies/schedule_tests-3
CMD: svn add working_copies/schedule_tests-3/X
working_copies/schedule_tests-3/A/C/Y
working_copies/schedule_tests-3/A/D/H/Z
CMD: svn status -v -u -q working_copies/schedule_tests-3
PASS: schedule_tests.py 3: schedule: add some nested files and directories
CMD: svnadmin create repositories/schedule_tests-4
CMD: svnadmin dump local_tmp/repos | svnadmin load
repositories/schedule_tests-4
CMD: svn co --username apache --password jandom
http://192.168.49.21/repositories/schedule_tests-4
working_copies/schedule_tests-4
CMD: svn add working_copies/schedule_tests-4/all_exe
CMD: svn propget svn:executable working_copies/schedule_tests-4/all_exe
CMD: svn add working_copies/schedule_tests-4/none_exe
CMD: svn propget svn:executable working_copies/schedule_tests-4/none_exe
CMD: svn add working_copies/schedule_tests-4/user_exe
CMD: svn propget svn:executable working_copies/schedule_tests-4/user_exe
CMD: svn add working_copies/schedule_tests-4/group_exe
CMD: svn propget svn:executable working_copies/schedule_tests-4/group_exe
CMD: svn add working_copies/schedule_tests-4/other_exe
CMD: svn propget svn:executable working_copies/schedule_tests-4/other_exe
PASS: schedule_tests.py 4: schedule: add some executable files
CMD: svnadmin create repositories/schedule_tests-5
CMD: svnadmin dump local_tmp/repos | svnadmin load
repositories/schedule_tests-5
CMD: svn co --username apache --password jandom
http://192.168.49.21/repositories/schedule_tests-5
working_copies/schedule_tests-5
CMD: svn del working_copies/schedule_tests-5/iota
working_copies/schedule_tests-5/A/mu
working_copies/schedule_tests-5/A/D/G/rho
working_copies/schedule_tests-5/A/D/H/omega
CMD: svn status -v -u -q working_copies/schedule_tests-5
PASS: schedule_tests.py 5: schedule: delete some files
CMD: svnadmin create repositories/schedule_tests-6
CMD: svnadmin dump local_tmp/repos | svnadmin load
repositories/schedule_tests-6
CMD: svn co --username apache --password jandom
http://192.168.49.21/repositories/schedule_tests-6
working_copies/schedule_tests-6
CMD: svn del working_copies/schedule_tests-6/A/B/E
working_copies/schedule_tests-6/A/B/F
working_copies/schedule_tests-6/A/D/H
CMD: svn status -v -u -q working_copies/schedule_tests-6
PASS: schedule_tests.py 6: schedule: delete some directories
CMD: svnadmin create repositories/schedule_tests-7
CMD: svnadmin dump local_tmp/repos | svnadmin load
repositories/schedule_tests-7
CMD: svn co --username apache --password jandom
http://192.168.49.21/repositories/schedule_tests-7
working_copies/schedule_tests-7
CMD: svn add working_copies/schedule_tests-7/delta
working_copies/schedule_tests-7/A/B/zeta
working_copies/schedule_tests-7/A/D/G/epsilon
CMD: svn status -v -u -q working_copies/schedule_tests-7
CMD: svn revert --recursive working_copies/schedule_tests-7
PASS: schedule_tests.py 7: revert: add some files
CMD: svnadmin create repositories/schedule_tests-8
CMD: svnadmin dump local_tmp/repos | svnadmin load
repositories/schedule_tests-8
CMD: svn co --username apache --password jandom
http://192.168.49.21/repositories/schedule_tests-8
working_copies/schedule_tests-8
CMD: svn add working_copies/schedule_tests-8/X
working_copies/schedule_tests-8/A/C/Y
working_copies/schedule_tests-8/A/D/H/Z
CMD: svn status -v -u -q working_copies/schedule_tests-8
CMD: svn revert --recursive working_copies/schedule_tests-8
PASS: schedule_tests.py 8: revert: add some directories
CMD: svnadmin create repositories/schedule_tests-9
CMD: svnadmin dump local_tmp/repos | svnadmin load
repositories/schedule_tests-9
CMD: svn co --username apache --password jandom
http://192.168.49.21/repositories/schedule_tests-9
working_copies/schedule_tests-9
CMD: svn add working_copies/schedule_tests-9/X
working_copies/schedule_tests-9/A/C/Y
working_copies/schedule_tests-9/A/D/H/Z
CMD: svn status -v -u -q working_copies/schedule_tests-9
CMD: svn revert --recursive working_copies/schedule_tests-9
PASS: schedule_tests.py 9: revert: add some nested files and directories
CMD: svnadmin create repositories/schedule_tests-10
CMD: svnadmin dump local_tmp/repos | svnadmin load
repositories/schedule_tests-10
CMD: svn co --username apache --password jandom
http://192.168.49.21/repositories/schedule_tests-10
working_copies/schedule_tests-10
CMD: svn add working_copies/schedule_tests-10/all_exe
CMD: svn propget svn:executable working_copies/schedule_tests-10/all_exe
CMD: svn add working_copies/schedule_tests-10/none_exe
CMD: svn propget svn:executable working_copies/schedule_tests-10/none_exe
CMD: svn add working_copies/schedule_tests-10/user_exe
CMD: svn propget svn:executable working_copies/schedule_tests-10/user_exe
CMD: svn add working_copies/schedule_tests-10/group_exe
CMD: svn propget svn:executable
working_copies/schedule_tests-10/group_exe
CMD: svn add working_copies/schedule_tests-10/other_exe
CMD: svn propget svn:executable
working_copies/schedule_tests-10/other_exe
CMD: svn revert --recursive working_copies/schedule_tests-10
PASS: schedule_tests.py 10: revert: add some executable files
CMD: svnadmin create repositories/schedule_tests-11
CMD: svnadmin dump local_tmp/repos | svnadmin load
repositories/schedule_tests-11
CMD: svn co --username apache --password jandom
http://192.168.49.21/repositories/schedule_tests-11
working_copies/schedule_tests-11
CMD: svn del working_copies/schedule_tests-11/iota
working_copies/schedule_tests-11/A/mu
working_copies/schedule_tests-11/A/D/G/rho
working_copies/schedule_tests-11/A/D/H/omega
CMD: svn status -v -u -q working_copies/schedule_tests-11
CMD: svn revert --recursive working_copies/schedule_tests-11
PASS: schedule_tests.py 11: revert: delete some files
CMD: svnadmin create repositories/schedule_tests-12
CMD: svnadmin dump local_tmp/repos | svnadmin load
repositories/schedule_tests-12
CMD: svn co --username apache --password jandom
http://192.168.49.21/repositories/schedule_tests-12
working_copies/schedule_tests-12
CMD: svn del working_copies/schedule_tests-12/A/B/E
working_copies/schedule_tests-12/A/B/F
working_copies/schedule_tests-12/A/D/H
CMD: svn status -v -u -q working_copies/schedule_tests-12
CMD: svn revert --recursive working_copies/schedule_tests-12
PASS: schedule_tests.py 12: revert: delete some directories
CMD: svnadmin create repositories/schedule_tests-13
CMD: svnadmin dump local_tmp/repos | svnadmin load
repositories/schedule_tests-13
CMD: svn co --username apache --password jandom
http://192.168.49.21/repositories/schedule_tests-13
working_copies/schedule_tests-13
CMD: svn add working_copies/schedule_tests-13/delta
working_copies/schedule_tests-13/A/B/zeta
working_copies/schedule_tests-13/A/D/G/epsilon
CMD: svn status -v -u -q working_copies/schedule_tests-13
XFAIL: schedule_tests.py 13: commit: add some files
CMD: svnadmin create repositories/schedule_tests-14
CMD: svnadmin dump local_tmp/repos | svnadmin load
repositories/schedule_tests-14
CMD: svn co --username apache --password jandom
http://192.168.49.21/repositories/schedule_tests-14
working_copies/schedule_tests-14
CMD: svn add working_copies/schedule_tests-14/X
working_copies/schedule_tests-14/A/C/Y
working_copies/schedule_tests-14/A/D/H/Z
CMD: svn status -v -u -q working_copies/schedule_tests-14
XFAIL: schedule_tests.py 14: commit: add some directories
CMD: svnadmin create repositories/schedule_tests-15
CMD: svnadmin dump local_tmp/repos | svnadmin load
repositories/schedule_tests-15
CMD: svn co --username apache --password jandom
http://192.168.49.21/repositories/schedule_tests-15
working_copies/schedule_tests-15
CMD: svn add working_copies/schedule_tests-15/X
working_copies/schedule_tests-15/A/C/Y
working_copies/schedule_tests-15/A/D/H/Z
CMD: svn status -v -u -q working_copies/schedule_tests-15
XFAIL: schedule_tests.py 15: commit: add some nested files and directories
CMD: svnadmin create repositories/schedule_tests-16
CMD: svnadmin dump local_tmp/repos | svnadmin load
repositories/schedule_tests-16
CMD: svn co --username apache --password jandom
http://192.168.49.21/repositories/schedule_tests-16
working_copies/schedule_tests-16
CMD: svn add working_copies/schedule_tests-16/all_exe
CMD: svn propget svn:executable working_copies/schedule_tests-16/all_exe
CMD: svn add working_copies/schedule_tests-16/none_exe
CMD: svn propget svn:executable working_copies/schedule_tests-16/none_exe
CMD: svn add working_copies/schedule_tests-16/user_exe
CMD: svn propget svn:executable working_copies/schedule_tests-16/user_exe
CMD: svn add working_copies/schedule_tests-16/group_exe
CMD: svn propget svn:executable
working_copies/schedule_tests-16/group_exe
CMD: svn add working_copies/schedule_tests-16/other_exe
CMD: svn propget svn:executable
working_copies/schedule_tests-16/other_exe
XFAIL: schedule_tests.py 16: commit: add some executable files
CMD: svnadmin create repositories/schedule_tests-17
CMD: svnadmin dump local_tmp/repos | svnadmin load
repositories/schedule_tests-17
CMD: svn co --username apache --password jandom
http://192.168.49.21/repositories/schedule_tests-17
working_copies/schedule_tests-17
CMD: svn del working_copies/schedule_tests-17/iota
working_copies/schedule_tests-17/A/mu
working_copies/schedule_tests-17/A/D/G/rho
working_copies/schedule_tests-17/A/D/H/omega
CMD: svn status -v -u -q working_copies/schedule_tests-17
XFAIL: schedule_tests.py 17: commit: delete some files
CMD: svnadmin create repositories/schedule_tests-18
CMD: svnadmin dump local_tmp/repos | svnadmin load
repositories/schedule_tests-18
CMD: svn co --username apache --password jandom
http://192.168.49.21/repositories/schedule_tests-18
working_copies/schedule_tests-18
CMD: svn del working_copies/schedule_tests-18/A/B/E
working_copies/schedule_tests-18/A/B/F
working_copies/schedule_tests-18/A/D/H
CMD: svn status -v -u -q working_copies/schedule_tests-18
XFAIL: schedule_tests.py 18: commit: delete some directories
CMD: svnadmin create repositories/schedule_tests-19
CMD: svnadmin dump local_tmp/repos | svnadmin load
repositories/schedule_tests-19
CMD: svn co --username apache --password jandom
http://192.168.49.21/repositories/schedule_tests-19
working_copies/schedule_tests-19
CMD: svn add working_copies/schedule_tests-19/file1
working_copies/schedule_tests-19/file2
CMD: svn mkdir working_copies/schedule_tests-19/dir1
working_copies/schedule_tests-19/dir2
CMD: svn status -v -u -q working_copies/schedule_tests-19
CMD: svn rm working_copies/schedule_tests-19/file1
working_copies/schedule_tests-19/dir1
CMD: svn revert working_copies/schedule_tests-19/file2
working_copies/schedule_tests-19/dir2
CMD: svn status -v -u -q working_copies/schedule_tests-19
PASS: schedule_tests.py 19: schedule: unschedule addition on missing items
CMD: svnadmin create repositories/schedule_tests-20
CMD: svnadmin dump local_tmp/repos | svnadmin load
repositories/schedule_tests-20
CMD: svn co --username apache --password jandom
http://192.168.49.21/repositories/schedule_tests-20
working_copies/schedule_tests-20
CMD: svn rm working_copies/schedule_tests-20/A/mu
working_copies/schedule_tests-20/A/D/H
CMD: svn ci -m log msg working_copies/schedule_tests-20
CMD: svn status -v -u -q working_copies/schedule_tests-20
PASS: schedule_tests.py 20: schedule: schedule ( commit) deletion on
missing items
END: schedule_tests.py

START: log_tests.py
CMD: svnadmin create local_tmp/repos
CMD: svn import --username apache --password jandom -m Log
message for revision 1. http://192.168.49.21/local_tmp/repos
local_tmp/greekfiles
CMD: svnadmin create repositories/log_tests-1
CMD: svnadmin dump local_tmp/repos | svnadmin load repositories/log_tests-1
CMD: svn co --username apache --password jandom
http://192.168.49.21/repositories/log_tests-1 working_copies/log_tests-1
CMD: svn ci -m Log message for revision 2
CMD: svn up
CMD: svn ci -m Log message for revision 3
CMD: svn up
CMD: svn add A/C/epsilon
CMD: svn ci -m Log message for revision 4
CMD: svn up
CMD: svn rm A/D/G/rho
CMD: svn ci -m Log message for revision 5
CMD: svn up
CMD: svn ps blue azul A/B
CMD: svn ci -m Log message for revision 6
CMD: svn up
CMD: svn ps red burgundy A/mu
CMD: svn ci -m Log message for revision 7
CMD: svn up
CMD: svn add A/D/G/rho
CMD: svn ci -m Log message for revision 8
CMD: svn up
CMD: svn rm A/B/E/alpha
CMD: svn ci -m Log message for revision 9
CMD: svn up
CMD: svn status -v -u -q working_copies/log_tests-1
CMD: svn log
PASS: log_tests.py 1: 'svn log', no args, top of wc.
CMD: svnadmin create repositories/log_tests-2
CMD: svnadmin dump local_tmp/repos | svnadmin load repositories/log_tests-2
CMD: svn co --username apache --password jandom
http://192.168.49.21/repositories/log_tests-2 working_copies/log_tests-2
CMD: svn ci -F A/D/H/omega
CMD: svn ci -F A/D/H/omega --force
CMD: svn ci -F A/D/H/omega A/mu
CMD: svn ci -F A/D/H/omega --force A/mu
PASS: log_tests.py 2: 'svn commit -F foo' when foo is a versioned file
CMD: svnadmin create repositories/log_tests-3
CMD: svn log --username apache --password jandom
http://192.168.49.21/repositories/log_tests-2
PASS: log_tests.py 3: test 'svn log' on an empty repository
CMD: svnadmin create repositories/log_tests-4
CMD: svnadmin dump local_tmp/repos | svnadmin load repositories/log_tests-4
CMD: svn co --username apache --password jandom
http://192.168.49.21/repositories/log_tests-4 working_copies/log_tests-4
CMD: svn ci -m log msg working_copies/log_tests-4/A/D/G/rho
CMD: svn log -r 2 working_copies/log_tests-4/A/D/H
PASS: log_tests.py 4: test 'svn log -rN some_dir_unchanged_in_N'
END: log_tests.py

START: copy_tests.py
CMD: svnadmin create local_tmp/repos
CMD: svn import --username apache --password jandom -m Log
message for revision 1. http://192.168.49.21/local_tmp/repos
local_tmp/greekfiles
CMD: svnadmin create repositories/copy_tests-1
CMD: svnadmin dump local_tmp/repos | svnadmin load
repositories/copy_tests-1
CMD: svn co --username apache --password jandom
http://192.168.49.21/repositories/copy_tests-1
working_copies/copy_tests-1
CMD: svn cp working_copies/copy_tests-1/A/D/G/rho
working_copies/copy_tests-1/A/D
CMD: svn cp working_copies/copy_tests-1/A/B/E/alpha
working_copies/copy_tests-1/A/C/alpha2
CMD: svn mv --force working_copies/copy_tests-1/A/mu
working_copies/copy_tests-1/A/D/H
CMD: svn mv working_copies/copy_tests-1/iota
working_copies/copy_tests-1/A/B/F
CMD: svn ci -m log msg working_copies/copy_tests-1
CMD: svn status -v -u -q working_copies/copy_tests-1
CMD: svn ci -m log msg working_copies/copy_tests-1
CMD: svn status -v -u -q working_copies/copy_tests-1
PASS: copy_tests.py 1: basic copy and move commands -- on files only
CMD: svnadmin create repositories/copy_tests-2
CMD: svnadmin dump local_tmp/repos | svnadmin load
repositories/copy_tests-2
CMD: svn co --username apache --password jandom
http://192.168.49.21/repositories/copy_tests-2
working_copies/copy_tests-2
CMD: svn mv working_copies/copy_tests-2/A/unversioned
working_copies/copy_tests-2/A/hypothetical-dest
PASS: copy_tests.py 2: test fix for 'svn mv unversioned_file some_dst'
CMD: svnadmin create repositories/copy_tests-3
CMD: svnadmin dump local_tmp/repos | svnadmin load
repositories/copy_tests-3
CMD: svn co --username apache --password jandom
http://192.168.49.21/repositories/copy_tests-3
working_copies/copy_tests-3
CMD: svn cp working_copies/copy_tests-3/A/D/G
working_copies/copy_tests-3/A/B/newG
CMD: svn ci -m log msg working_copies/copy_tests-3
CMD: svn status -v -u -q working_copies/copy_tests-3
CMD: svn up working_copies/copy_tests-3backup
CMD: svn status -v -u -q working_copies/copy_tests-3backup
PASS: copy_tests.py 3: receive a copied directory during update
CMD: svnadmin create repositories/copy_tests-4
CMD: svnadmin dump local_tmp/repos | svnadmin load
repositories/copy_tests-4
CMD: svn co --username apache --password jandom
http://192.168.49.21/repositories/copy_tests-4
working_copies/copy_tests-4
CMD: svn rm --force working_copies/copy_tests-4/A/D/G
CMD: svn ci -m log msg working_copies/copy_tests-4
CMD: svn status -v -u -q working_copies/copy_tests-4
CMD: svn cp --username apache --password jandom -r 1
http://192.168.49.21/repositories/copy_tests-4/A/D/G
http://192.168.49.21/repositories/copy_tests-4/A/D/G -m logmsg
CMD: svn up working_copies/copy_tests-4
CMD: svn status -v -u -q working_copies/copy_tests-4
PASS: copy_tests.py 4: resurrect a deleted directory
CMD: svnadmin create repositories/copy_tests-5
CMD: svnadmin dump local_tmp/repos | svnadmin load
repositories/copy_tests-5
CMD: svn co --username apache --password jandom
http://192.168.49.21/repositories/copy_tests-5
working_copies/copy_tests-5
CMD: svn cp http://192.168.49.21/repositories/copy_tests-5/A/B/E/alpha
http://192.168.49.21/repositories/copy_tests-5/A/B/E/beta --username
apache --password jandom -m fooogle
CMD: svn cp http://192.168.49.21/repositories/copy_tests-5/A/D/G
http://192.168.49.21/repositories/copy_tests-5/A/D/H --username
apache --password jandom -m fooogle
CMD: svn cp http://192.168.49.21/repositories/copy_tests-5/A/D/G
http://192.168.49.21/repositories/copy_tests-5/A/D/H --username
apache --password jandom -m fooogle
PASS: copy_tests.py 5: svn cp URL URL cannot overwrite destination
CMD: svnadmin create repositories/copy_tests-6
CMD: svnadmin dump local_tmp/repos | svnadmin load
repositories/copy_tests-6
CMD: svn co --username apache --password jandom
http://192.168.49.21/repositories/copy_tests-6
working_copies/copy_tests-6
CMD: svn rm working_copies/copy_tests-6/A/D/G/rho
CMD: svn status -v -u -q working_copies/copy_tests-6
CMD: svn cp working_copies/copy_tests-6/A/D/G/pi
working_copies/copy_tests-6/A/D/G/rho
CMD: svn cp working_copies/copy_tests-6/A/D/G/pi
working_copies/copy_tests-6/A/D/G/tau
CMD: svn cp working_copies/copy_tests-6/A/D/G/pi
working_copies/copy_tests-6/A/B/E/alpha
CMD: svn status -v -u -q working_copies/copy_tests-6
PASS: copy_tests.py 6: svn cp PATH PATH cannot overwrite destination
CMD: svnadmin create repositories/copy_tests-7
CMD: svnadmin dump local_tmp/repos | svnadmin load
repositories/copy_tests-7
CMD: svn co --username apache --password jandom
http://192.168.49.21/repositories/copy_tests-7
working_copies/copy_tests-7
CMD: svn cp working_copies/copy_tests-7/A/B
working_copies/copy_tests-7/A/B2 -m fooogle
CMD: svn ci -m log msg working_copies/copy_tests-7
PASS: copy_tests.py 7: copy a directory hierarchy and modify before commit
CMD: svnadmin create repositories/copy_tests-8
CMD: svnadmin dump local_tmp/repos | svnadmin load
repositories/copy_tests-8
CMD: svn co --username apache --password jandom
http://192.168.49.21/repositories/copy_tests-8
working_copies/copy_tests-8
CMD: svn propset pname pval working_copies/copy_tests-8/A/D/G/rho
CMD: svn ci -m log msg working_copies/copy_tests-8
CMD: svn status -v -u -q working_copies/copy_tests-8
CMD: svn propset pname2 pval2 working_copies/copy_tests-8/A/D/G/rho
CMD: svn copy working_copies/copy_tests-8/A/D/G/rho
working_copies/copy_tests-8/A/D/G/rho_wc
CMD: svn copy http://192.168.49.21/repositories/copy_tests-8/A/D/G/rho
working_copies/copy_tests-8/A/D/G/rho_url
CMD: svn status -v -u -q working_copies/copy_tests-8
CMD: svn propget pname working_copies/copy_tests-8/A/D/G/rho_wc
CMD: svn propget pname2 working_copies/copy_tests-8/A/D/G/rho_wc
CMD: svn propget pname working_copies/copy_tests-8/A/D/G/rho_url
CMD: svn ci -m log msg working_copies/copy_tests-8
CMD: svn status -v -u -q working_copies/copy_tests-8
PASS: copy_tests.py 8: copy files with properties
CMD: svnadmin create repositories/copy_tests-9
CMD: svnadmin dump local_tmp/repos | svnadmin load
repositories/copy_tests-9
CMD: svn co --username apache --password jandom
http://192.168.49.21/repositories/copy_tests-9
working_copies/copy_tests-9
CMD: svn cp working_copies/copy_tests-9/A/B
working_copies/copy_tests-9/A/B2 -m fooogle
CMD: svn rm working_copies/copy_tests-9/A/B2/E/alpha
CMD: svn ci -m log msg working_copies/copy_tests-9
CMD: svn cp working_copies/copy_tests-9/A/B
working_copies/copy_tests-9/A/B3 -m fooogle
CMD: svn rm working_copies/copy_tests-9/A/B3/E
CMD: svn ci -m log msg working_copies/copy_tests-9
PASS: copy_tests.py 9: copy a tree and delete part of it before commit
CMD: svnadmin create repositories/copy_tests-10
CMD: svnadmin dump local_tmp/repos | svnadmin load
repositories/copy_tests-10
CMD: svn co --username apache --password jandom
http://192.168.49.21/repositories/copy_tests-10
working_copies/copy_tests-10
CMD: svn move working_copies/copy_tests-10/A/B/E
working_copies/copy_tests-10/A/B/F
CMD: svn status -v -u -q working_copies/copy_tests-10
CMD: svn revert --recursive working_copies/copy_tests-10/A/B/F/E
CMD: svn status -v -u -q working_copies/copy_tests-10
PASS: copy_tests.py 10: move and revert a directory
CMD: svnadmin create repositories/copy_tests-11
CMD: svnadmin dump local_tmp/repos | svnadmin load
repositories/copy_tests-11
CMD: svn co --username apache --password jandom
http://192.168.49.21/repositories/copy_tests-11
working_copies/copy_tests-11
CMD: svn add working_copies/copy_tests-11/newfile1
CMD: svn propset svn:executable on
working_copies/copy_tests-11/newfile1
CMD: svn ci -m create file and set svn:executable
working_copies/copy_tests-11
CMD: svn cp working_copies/copy_tests-11/newfile1
working_copies/copy_tests-11/newfile2
PASS: copy_tests.py 11: executable bit should be preserved when copying
CMD: svnadmin create repositories/copy_tests-12
CMD: svnadmin dump local_tmp/repos | svnadmin load
repositories/copy_tests-12
CMD: svn co --username apache --password jandom
http://192.168.49.21/repositories/copy_tests-12
working_copies/copy_tests-12
CMD: svn propset foo bar working_copies/copy_tests-12/A/B/E/beta
CMD: svn -m fumble file copy
working_copies/copy_tests-12/A/B/E/beta
http://192.168.49.21/repositories/copy_tests-12/A/B/E/beta2
CMD: svn -m fumble dir copy working_copies/copy_tests-12/A/D/H
http://192.168.49.21/repositories/copy_tests-12/A/D/H2
CMD: svn up working_copies/copy_tests-12
CMD: svn status -v -u -q working_copies/copy_tests-12
CMD: svn propget foo working_copies/copy_tests-12/A/B/E/beta2
PASS: copy_tests.py 12: working-copy to repository copy
END: copy_tests.py

START: diff_tests.py
CMD: svnadmin create local_tmp/repos
CMD: svn import --username apache --password jandom -m Log
message for revision 1. http://192.168.49.21/local_tmp/repos
local_tmp/greekfiles
CMD: svnadmin create repositories/diff_tests-1
CMD: svnadmin dump local_tmp/repos | svnadmin load
repositories/diff_tests-1
CMD: svn co --username apache --password jandom
http://192.168.49.21/repositories/diff_tests-1
working_copies/diff_tests-1
CMD: svn up -r HEAD
CMD: svn diff
CMD: svn diff -r HEAD
CMD: svn ci -m log msg
CMD: svn up
CMD: svn diff -r 1
PASS: diff_tests.py 1: update a file
CMD: svnadmin create repositories/diff_tests-2
CMD: svnadmin dump local_tmp/repos | svnadmin load
repositories/diff_tests-2
CMD: svn co --username apache --password jandom
http://192.168.49.21/repositories/diff_tests-2
working_copies/diff_tests-2
CMD: svn up -r HEAD
CMD: svn add A/B/E/theta
CMD: svn diff
CMD: svn diff -r HEAD
CMD: svn ci -m log msg
CMD: svn up
CMD: svn diff -r 1
PASS: diff_tests.py 2: add a file
CMD: svnadmin create repositories/diff_tests-3
CMD: svnadmin dump local_tmp/repos | svnadmin load
repositories/diff_tests-3
CMD: svn co --username apache --password jandom
http://192.168.49.21/repositories/diff_tests-3
working_copies/diff_tests-3
CMD: svn up -r HEAD
CMD: svn add A/B/T
CMD: svn add A/B/T/phi
CMD: svn diff
CMD: svn diff -r HEAD
CMD: svn ci -m log msg
CMD: svn up
CMD: svn diff -r 1
PASS: diff_tests.py 3: add a file in an added directory
CMD: svnadmin create repositories/diff_tests-4
CMD: svnadmin dump local_tmp/repos | svnadmin load
repositories/diff_tests-4
CMD: svn co --username apache --password jandom
http://192.168.49.21/repositories/diff_tests-4
working_copies/diff_tests-4
CMD: svn up -r HEAD
CMD: svn rm A/D/G/rho
CMD: svn add A/D/G/rho
CMD: svn diff
CMD: svn diff -r HEAD
CMD: svn ci -m log msg
CMD: svn up
CMD: svn diff -r 1
PASS: diff_tests.py 4: replace a file with a file
CMD: svnadmin create repositories/diff_tests-5
CMD: svnadmin dump local_tmp/repos | svnadmin load
repositories/diff_tests-5
CMD: svn co --username apache --password jandom
http://192.168.49.21/repositories/diff_tests-5
working_copies/diff_tests-5
CMD: svn up -r HEAD
CMD: svn add A/B/E/theta
CMD: svn diff
CMD: svn diff -r HEAD
CMD: svn ci -m log msg
CMD: svn up
CMD: svn diff -r 1
CMD: svn up -r HEAD
CMD: svn add A/B/T
CMD: svn add A/B/T/phi
CMD: svn diff
CMD: svn diff -r HEAD
CMD: svn ci -m log msg
CMD: svn up
CMD: svn diff -r 2
CMD: svn up -r HEAD
CMD: svn diff
CMD: svn diff -r HEAD
CMD: svn ci -m log msg
CMD: svn up
CMD: svn diff -r 3
CMD: svn up -r 4
CMD: svn diff -r 1
CMD: svn diff -r 1
CMD: svn diff -r 1
CMD: svn up -r 1
CMD: svn diff -r 4
CMD: svn diff -r 4
CMD: svn diff -r 4
CMD: svn diff -r 1:4
CMD: svn diff -r 1:4
CMD: svn diff -r 1:4
CMD: svn diff -r 4:1
CMD: svn diff -r 4:1
PASS: diff_tests.py 5: multiple revisions diff'd forwards and backwards
CMD: svnadmin create repositories/diff_tests-6
CMD: svnadmin dump local_tmp/repos | svnadmin load
repositories/diff_tests-6
CMD: svn co --username apache --password jandom
http://192.168.49.21/repositories/diff_tests-6
working_copies/diff_tests-6
CMD: svn up -r HEAD
CMD: svn diff
CMD: svn diff -r HEAD
CMD: svn ci -m log msg
CMD: svn up
CMD: svn diff -r 1
CMD: svn diff -r 1 working_copies/diff_tests-6/A/D
CMD: svn diff -r 1 -N working_copies/diff_tests-6/A/D
CMD: svn diff -r 1 working_copies/diff_tests-6/A/D/G
PASS: diff_tests.py 6: non-recursive behaviour
CMD: svnadmin create repositories/diff_tests-7
CMD: svnadmin dump local_tmp/repos | svnadmin load
repositories/diff_tests-7
CMD: svn co --username apache --password jandom
http://192.168.49.21/repositories/diff_tests-7
working_copies/diff_tests-7
CMD: svn add A/B/E/theta
CMD: svn add A/B/T
CMD: svn add A/B/T/phi
CMD: svn diff A/B
CMD: svn diff -r HEAD A/B
CMD: svn diff A/B/E/alpha
CMD: svn diff -r HEAD A/B/E/alpha
CMD: svn diff A/B
CMD: svn diff -r HEAD A/B
CMD: svn diff A/B/E/theta
CMD: svn diff A/B/T
CMD: svn diff A/B/T/phi
PASS: diff_tests.py 7: diff only part of the repository
CMD: svnadmin create repositories/diff_tests-8
CMD: svnadmin dump local_tmp/repos | svnadmin load
repositories/diff_tests-8
CMD: svn co --username apache --password jandom
http://192.168.49.21/repositories/diff_tests-8
working_copies/diff_tests-8
CMD: svn diff working_copies/diff_tests-8/A/D/foo
PASS: diff_tests.py 8: non version controlled files
CMD: svnadmin create repositories/diff_tests-9
CMD: svnadmin dump local_tmp/repos | svnadmin load
repositories/diff_tests-9
CMD: svn co --username apache --password jandom
http://192.168.49.21/repositories/diff_tests-9
working_copies/diff_tests-9
CMD: svn ci -m log msg
CMD: svn add A/B/T
CMD: svn add A/B/T/phi
CMD: svn ci -m log msg
CMD: svn add A/B/E/theta
CMD: svn ci -m log msg
CMD: svn ci -m log msg
CMD: svn up -r 2
CMD: svn diff -r 1:2 --username apache --password jandom
http://192.168.49.21/repositories/diff_tests-9
CMD: svn diff -r 1:2 --username apache --password jandom
CMD: svn diff -r 2:3 --username apache --password jandom
http://192.168.49.21/repositories/diff_tests-9
CMD: svn diff -r 2:3 --username apache --password jandom
CMD: svn diff -r 4:5 --username apache --password jandom
http://192.168.49.21/repositories/diff_tests-9
CMD: svn diff -r 4:5 --username apache --password jandom
CMD: svn diff -r head
PASS: diff_tests.py 9: pure repository diff update a file
CMD: svnadmin create repositories/diff_tests-10
CMD: svnadmin dump local_tmp/repos | svnadmin load
repositories/diff_tests-10
CMD: svn co --username apache --password jandom
http://192.168.49.21/repositories/diff_tests-10
working_copies/diff_tests-10
CMD: svn propset svn:eol-style native iota
CMD: svn ci -m empty-msg
CMD: svn diff -r 1:2
CMD: svn diff -r 2:1
CMD: svn diff -r 1
PASS: diff_tests.py 10: diff when property was changed but text was not
END: diff_tests.py

START: externals_tests.py
CMD: svnadmin create local_tmp/repos
CMD: svn import --username apache --password jandom -m Log
message for revision 1. http://192.168.49.21/local_tmp/repos
local_tmp/greekfiles
CMD: svnadmin create repositories/externals_tests-1
CMD: svnadmin dump local_tmp/repos | svnadmin load
repositories/externals_tests-1
CMD: svn co --username apache --password jandom
http://192.168.49.21/repositories/externals_tests-1
working_copies/externals_tests-1
CMD: svn checkout --username apache --password jandom
http://192.168.49.21/repositories/externals_tests-1
working_copies/externals_tests-1.init
CMD: svn ci -m log msg --quiet working_copies/externals_tests-1.init
CMD: svn ci -m log msg --quiet working_copies/externals_tests-1.init
CMD: svn ci -m log msg --quiet working_copies/externals_tests-1.init
CMD: svn ci -m log msg --quiet working_copies/externals_tests-1.init
CMD: svn up working_copies/externals_tests-1.init
CMD: svnadmin create repositories/externals_tests-1.other
CMD: svnadmin dump repositories/externals_tests-1 | svnadmin load
repositories/externals_tests-1.other
CMD: svn pset -F working_copies/externals_tests-1.init/tmp8vQekU
svn:externals working_copies/externals_tests-1.init/A/B
CMD: svn pset -F working_copies/externals_tests-1.init/tmp8vQekU
svn:externals working_copies/externals_tests-1.init/A/D
CMD: svn ci -m log msg working_copies/externals_tests-1.init
CMD: svn status -v -u -q working_copies/externals_tests-1.init
CMD: svn checkout --username apache --password jandom
http://192.168.49.21/repositories/externals_tests-1
working_copies/externals_tests-1
PASS: externals_tests.py 1: check out a directory with some external
modules attached
CMD: svnadmin create repositories/externals_tests-2
CMD: svnadmin dump local_tmp/repos | svnadmin load
repositories/externals_tests-2
CMD: svn co --username apache --password jandom
http://192.168.49.21/repositories/externals_tests-2
working_copies/externals_tests-2
CMD: svn checkout --username apache --password jandom
http://192.168.49.21/repositories/externals_tests-2
working_copies/externals_tests-2.init
CMD: svn ci -m log msg --quiet working_copies/externals_tests-2.init
CMD: svn ci -m log msg --quiet working_copies/externals_tests-2.init
CMD: svn ci -m log msg --quiet working_copies/externals_tests-2.init
CMD: svn ci -m log msg --quiet working_copies/externals_tests-2.init
CMD: svn up working_copies/externals_tests-2.init
CMD: svnadmin create repositories/externals_tests-2.other
CMD: svnadmin dump repositories/externals_tests-2 | svnadmin load
repositories/externals_tests-2.other
CMD: svn pset -F working_copies/externals_tests-2.init/tmpi5Bh8W
svn:externals working_copies/externals_tests-2.init/A/B
CMD: svn pset -F working_copies/externals_tests-2.init/tmpi5Bh8W
svn:externals working_copies/externals_tests-2.init/A/D
CMD: svn ci -m log msg working_copies/externals_tests-2.init
CMD: svn status -v -u -q working_copies/externals_tests-2.init
CMD: svn checkout --username apache --password jandom
http://192.168.49.21/repositories/externals_tests-2
working_copies/externals_tests-2
CMD: svn checkout --username apache --password jandom
http://192.168.49.21/repositories/externals_tests-2
working_copies/externals_tests-2.other
CMD: svn pset -F local_tmp/tmp0HJ8ID svn:externals
working_copies/externals_tests-2/A/D
CMD: svn ci -m log msg --quiet working_copies/externals_tests-2/A/D
CMD: svn up working_copies/externals_tests-2.other
PASS: externals_tests.py 2: update to receive a new external module.
CMD: svnadmin create repositories/externals_tests-3
CMD: svnadmin dump local_tmp/repos | svnadmin load
repositories/externals_tests-3
CMD: svn co --username apache --password jandom
http://192.168.49.21/repositories/externals_tests-3
working_copies/externals_tests-3
CMD: svn checkout --username apache --password jandom
http://192.168.49.21/repositories/externals_tests-3
working_copies/externals_tests-3.init
CMD: svn ci -m log msg --quiet working_copies/externals_tests-3.init
CMD: svn ci -m log msg --quiet working_copies/externals_tests-3.init
CMD: svn ci -m log msg --quiet working_copies/externals_tests-3.init
CMD: svn ci -m log msg --quiet working_copies/externals_tests-3.init
CMD: svn up working_copies/externals_tests-3.init
CMD: svnadmin create repositories/externals_tests-3.other
CMD: svnadmin dump repositories/externals_tests-3 | svnadmin load
repositories/externals_tests-3.other
CMD: svn pset -F working_copies/externals_tests-3.init/tmp0Fif6S
svn:externals working_copies/externals_tests-3.init/A/B
CMD: svn pset -F working_copies/externals_tests-3.init/tmp0Fif6S
svn:externals working_copies/externals_tests-3.init/A/D
CMD: svn ci -m log msg working_copies/externals_tests-3.init
CMD: svn status -v -u -q working_copies/externals_tests-3.init
CMD: svn checkout --username apache --password jandom
http://192.168.49.21/repositories/externals_tests-3
working_copies/externals_tests-3
CMD: svn checkout --username apache --password jandom
http://192.168.49.21/repositories/externals_tests-3
working_copies/externals_tests-3.other
CMD: svn pset -F local_tmp/tmpMUtq0L svn:externals
working_copies/externals_tests-3/A/D
CMD: svn ci -m log msg --quiet working_copies/externals_tests-3/A/D
CMD: svn up working_copies/externals_tests-3.other
PASS: externals_tests.py 3: update to lose an external module.
CMD: svnadmin create repositories/externals_tests-4
CMD: svnadmin dump local_tmp/repos | svnadmin load
repositories/externals_tests-4
CMD: svn co --username apache --password jandom
http://192.168.49.21/repositories/externals_tests-4
working_copies/externals_tests-4
CMD: svn checkout --username apache --password jandom
http://192.168.49.21/repositories/externals_tests-4
working_copies/externals_tests-4.init
CMD: svn ci -m log msg --quiet working_copies/externals_tests-4.init
CMD: svn ci -m log msg --quiet working_copies/externals_tests-4.init
CMD: svn ci -m log msg --quiet working_copies/externals_tests-4.init
CMD: svn ci -m log msg --quiet working_copies/externals_tests-4.init
CMD: svn up working_copies/externals_tests-4.init
CMD: svnadmin create repositories/externals_tests-4.other
CMD: svnadmin dump repositories/externals_tests-4 | svnadmin load
repositories/externals_tests-4.other
CMD: svn pset -F working_copies/externals_tests-4.init/tmpyH95Y7
svn:externals working_copies/externals_tests-4.init/A/B
CMD: svn pset -F working_copies/externals_tests-4.init/tmpyH95Y7
svn:externals working_copies/externals_tests-4.init/A/D
CMD: svn ci -m log msg working_copies/externals_tests-4.init
CMD: svn status -v -u -q working_copies/externals_tests-4.init
CMD: svn checkout --username apache --password jandom
http://192.168.49.21/repositories/externals_tests-4
working_copies/externals_tests-4
CMD: svn checkout --username apache --password jandom
http://192.168.49.21/repositories/externals_tests-4
working_copies/externals_tests-4.other
CMD: svn pset -F local_tmp/tmpuRCo36 svn:externals
working_copies/externals_tests-4/A/D
CMD: svn ci -m log msg --quiet working_copies/externals_tests-4/A/D
CMD: svn up working_copies/externals_tests-4.other
PASS: externals_tests.py 4: update to receive a change to an unmodifed
external module.
CMD: svnadmin create repositories/externals_tests-5
CMD: svnadmin dump local_tmp/repos | svnadmin load
repositories/externals_tests-5
CMD: svn co --username apache --password jandom
http://192.168.49.21/repositories/externals_tests-5
working_copies/externals_tests-5
CMD: svn checkout --username apache --password jandom
http://192.168.49.21/repositories/externals_tests-5
working_copies/externals_tests-5.init
CMD: svn ci -m log msg --quiet working_copies/externals_tests-5.init
CMD: svn ci -m log msg --quiet working_copies/externals_tests-5.init
CMD: svn ci -m log msg --quiet working_copies/externals_tests-5.init
CMD: svn ci -m log msg --quiet working_copies/externals_tests-5.init
CMD: svn up working_copies/externals_tests-5.init
CMD: svnadmin create repositories/externals_tests-5.other
CMD: svnadmin dump repositories/externals_tests-5 | svnadmin load
repositories/externals_tests-5.other
CMD: svn pset -F working_copies/externals_tests-5.init/tmpifsclA
svn:externals working_copies/externals_tests-5.init/A/B
CMD: svn pset -F working_copies/externals_tests-5.init/tmpifsclA
svn:externals working_copies/externals_tests-5.init/A/D
CMD: svn ci -m log msg working_copies/externals_tests-5.init
CMD: svn status -v -u -q working_copies/externals_tests-5.init
CMD: svn checkout --username apache --password jandom
http://192.168.49.21/repositories/externals_tests-5
working_copies/externals_tests-5
CMD: svn checkout --username apache --password jandom
http://192.168.49.21/repositories/externals_tests-5
working_copies/externals_tests-5.other
CMD: svn pset -F local_tmp/tmpaLaDCF svn:externals
working_copies/externals_tests-5/A/D
CMD: svn ci -m log msg --quiet working_copies/externals_tests-5/A/D
CMD: svn up working_copies/externals_tests-5.other
PASS: externals_tests.py 5: update to receive a change to a modified
external module.
CMD: svnadmin create repositories/externals_tests-6
CMD: svnadmin dump local_tmp/repos | svnadmin load
repositories/externals_tests-6
CMD: svn co --username apache --password jandom
http://192.168.49.21/repositories/externals_tests-6
working_copies/externals_tests-6
CMD: svn checkout --username apache --password jandom
http://192.168.49.21/repositories/externals_tests-6
working_copies/externals_tests-6.init
CMD: svn ci -m log msg --quiet working_copies/externals_tests-6.init
CMD: svn ci -m log msg --quiet working_copies/externals_tests-6.init
CMD: svn ci -m log msg --quiet working_copies/externals_tests-6.init
CMD: svn ci -m log msg --quiet working_copies/externals_tests-6.init
CMD: svn up working_copies/externals_tests-6.init
CMD: svnadmin create repositories/externals_tests-6.other
CMD: svnadmin dump repositories/externals_tests-6 | svnadmin load
repositories/externals_tests-6.other
CMD: svn pset -F working_copies/externals_tests-6.init/tmpClVIgg
svn:externals working_copies/externals_tests-6.init/A/B
CMD: svn pset -F working_copies/externals_tests-6.init/tmpClVIgg
svn:externals working_copies/externals_tests-6.init/A/D
CMD: svn ci -m log msg working_copies/externals_tests-6.init
CMD: svn status -v -u -q working_copies/externals_tests-6.init
CMD: svn checkout --username apache --password jandom
http://192.168.49.21/repositories/externals_tests-6
working_copies/externals_tests-6
CMD: svn checkout --username apache --password jandom
http://192.168.49.21/repositories/externals_tests-6.other
working_copies/externals_tests-6.other
CMD: svn ci -m log msg working_copies/externals_tests-6.other
CMD: svn status -v -u -q working_copies/externals_tests-6.other
CMD: svn up working_copies/externals_tests-6
CMD: svn ci -m log msg working_copies/externals_tests-6.other
CMD: svn status -v -u -q working_copies/externals_tests-6.other
CMD: svn up working_copies/externals_tests-6/A/B
PASS: externals_tests.py 6: update to receive a change under an external
module.
CMD: svnadmin create repositories/externals_tests-7
CMD: svnadmin dump local_tmp/repos | svnadmin load
repositories/externals_tests-7
CMD: svn co --username apache --password jandom
http://192.168.49.21/repositories/externals_tests-7
working_copies/externals_tests-7
CMD: svn checkout --username apache --password jandom
http://192.168.49.21/repositories/externals_tests-7
working_copies/externals_tests-7.init
CMD: svn ci -m log msg --quiet working_copies/externals_tests-7.init
CMD: svn ci -m log msg --quiet working_copies/externals_tests-7.init
CMD: svn ci -m log msg --quiet working_copies/externals_tests-7.init
CMD: svn ci -m log msg --quiet working_copies/externals_tests-7.init
CMD: svn up working_copies/externals_tests-7.init
CMD: svnadmin create repositories/externals_tests-7.other
CMD: svnadmin dump repositories/externals_tests-7 | svnadmin load
repositories/externals_tests-7.other
CMD: svn pset -F working_copies/externals_tests-7.init/tmpWFpfoR
svn:externals working_copies/externals_tests-7.init/A/B
CMD: svn pset -F working_copies/externals_tests-7.init/tmpWFpfoR
svn:externals working_copies/externals_tests-7.init/A/D
CMD: svn ci -m log msg working_copies/externals_tests-7.init
CMD: svn status -v -u -q working_copies/externals_tests-7.init
CMD: svn checkout --username apache --password jandom
http://192.168.49.21/repositories/externals_tests-7
working_copies/externals_tests-7
CMD: svn pset -F /tmp/file4vS4BM svn:externals
working_copies/externals_tests-7/A/B
CMD: svn up
PASS: externals_tests.py 7: modify to specify, and update to receive, a
new external module
END: externals_tests.py

START: merge_tests.py
CMD: svnadmin create local_tmp/repos
CMD: svn import --username apache --password jandom -m Log
message for revision 1. http://192.168.49.21/local_tmp/repos
local_tmp/greekfiles
CMD: svnadmin create repositories/merge_tests-1
CMD: svnadmin dump local_tmp/repos | svnadmin load
repositories/merge_tests-1
CMD: svn co --username apache --password jandom
http://192.168.49.21/repositories/merge_tests-1
working_copies/merge_tests-1
CMD: svn ci -m log msg working_copies/merge_tests-1
CMD: svn status -v -u -q working_copies/merge_tests-1
CMD: svn ci -m log msg working_copies/merge_tests-1
CMD: svn status -v -u -q working_copies/merge_tests-1
CMD: svn up -r 1 working_copies/merge_tests-1.other/A/D/G/rho
CMD: svn merge --dry-run -r 1:3
http://192.168.49.21/repositories/merge_tests-1
working_copies/merge_tests-1.other
CMD: svn merge -r 1:3
http://192.168.49.21/repositories/merge_tests-1
working_copies/merge_tests-1.other
CMD: svn status -v -u -q working_copies/merge_tests-1.other
CMD: svn revert working_copies/merge_tests-1.other/A/D/G/rho
CMD: svn up -r 2 working_copies/merge_tests-1.other/A/D/G/rho
CMD: svn merge --dry-run -r 2:3
http://192.168.49.21/repositories/merge_tests-1/A/D/G
working_copies/merge_tests-1.other/A/D/G
CMD: svn merge -r 2:3
http://192.168.49.21/repositories/merge_tests-1/A/D/G
working_copies/merge_tests-1.other/A/D/G
CMD: svn status -v -u -q working_copies/merge_tests-1.other/A/D/G
PASS: merge_tests.py 1: performing a merge, with mixed results
CMD: svnadmin create repositories/merge_tests-2
CMD: svnadmin dump local_tmp/repos | svnadmin load
repositories/merge_tests-2
CMD: svn co --username apache --password jandom
http://192.168.49.21/repositories/merge_tests-2
working_copies/merge_tests-2
CMD: svn mkdir working_copies/merge_tests-2/A/B/F/Q
CMD: svn add working_copies/merge_tests-2/A/B/F/foo
working_copies/merge_tests-2/A/B/F/Q/bar
CMD: svn ci -m log msg working_copies/merge_tests-2
CMD: svn status -v -u -q working_copies/merge_tests-2
CMD: svn merge -r 1:2
http://192.168.49.21/repositories/merge_tests-2/A/B/F
working_copies/merge_tests-2/A/C
CMD: svn status -v -u -q working_copies/merge_tests-2
CMD: svn ci -m log msg working_copies/merge_tests-2
CMD: svn status -v -u -q working_copies/merge_tests-2
PASS: merge_tests.py 2: merge and add new files/dirs with history
CMD: svnadmin create repositories/merge_tests-3
CMD: svnadmin dump local_tmp/repos | svnadmin load
repositories/merge_tests-3
CMD: svn co --username apache --password jandom
http://192.168.49.21/repositories/merge_tests-3
working_copies/merge_tests-3
CMD: svn copy working_copies/merge_tests-3/A/B
working_copies/merge_tests-3/A/B2
CMD: svn ci -m log msg working_copies/merge_tests-3
CMD: svn status -v -u -q working_copies/merge_tests-3
CMD: svn delete working_copies/merge_tests-3/A/B/E
working_copies/merge_tests-3/A/B/lambda
CMD: svn ci -m log msg working_copies/merge_tests-3
CMD: svn status -v -u -q working_copies/merge_tests-3
CMD: svn merge -r 2:3
http://192.168.49.21/repositories/merge_tests-3/A/B
working_copies/merge_tests-3/A/B2
CMD: svn status -v -u -q working_copies/merge_tests-3
PASS: merge_tests.py 3: merge and that deletes items
CMD: svnadmin create repositories/merge_tests-4
CMD: svnadmin dump local_tmp/repos | svnadmin load
repositories/merge_tests-4
CMD: svn co --username apache --password jandom
http://192.168.49.21/repositories/merge_tests-4
working_copies/merge_tests-4
CMD: svn propset foo foo_val working_copies/merge_tests-4/A/B/E/alpha
CMD: svn propset foo foo_val working_copies/merge_tests-4/A/B/E
CMD: svn ci -m log msg working_copies/merge_tests-4
CMD: svn status -v -u -q working_copies/merge_tests-4
CMD: svn up working_copies/merge_tests-4
CMD: svn copy -m fumble --username apache --password jandom
http://192.168.49.21/repositories/merge_tests-4/A/B
http://192.168.49.21/repositories/merge_tests-4/A/B2
CMD: svn up working_copies/merge_tests-4
CMD: svn propset foo mod_foo working_copies/merge_tests-4/A/B/E/alpha
CMD: svn propset bar bar_val working_copies/merge_tests-4/A/B/E/alpha
CMD: svn propset foo mod_foo working_copies/merge_tests-4/A/B/E
CMD: svn propset bar bar_val working_copies/merge_tests-4/A/B/E
CMD: svn ci -m log msg working_copies/merge_tests-4
CMD: svn status -v -u -q working_copies/merge_tests-4
CMD: svn up working_copies/merge_tests-4
CMD: svn merge --dry-run -r 3:4
http://192.168.49.21/repositories/merge_tests-4/A/B
working_copies/merge_tests-4/A/B2
CMD: svn merge -r 3:4
http://192.168.49.21/repositories/merge_tests-4/A/B
working_copies/merge_tests-4/A/B2
CMD: svn status -v -u -q working_copies/merge_tests-4
CMD: svn revert --recursive working_copies/merge_tests-4
CMD: svn status -v -u -q working_copies/merge_tests-4
CMD: svn merge --dry-run -r 2:1
http://192.168.49.21/repositories/merge_tests-4/A/B
working_copies/merge_tests-4/A/B2
CMD: svn merge -r 2:1
http://192.168.49.21/repositories/merge_tests-4/A/B
working_copies/merge_tests-4/A/B2
CMD: svn status -v -u -q working_copies/merge_tests-4
CMD: svn merge --dry-run -r 3:4
http://192.168.49.21/repositories/merge_tests-4/A/B
working_copies/merge_tests-4/A/B2
CMD: svn merge -r 3:4
http://192.168.49.21/repositories/merge_tests-4/A/B
working_copies/merge_tests-4/A/B2
CMD: svn status -v -u -q working_copies/merge_tests-4
PASS: merge_tests.py 4: some simple property merges
END: merge_tests.py

START: stat_tests.py
CMD: svnadmin create local_tmp/repos
CMD: svn import --username apache --password jandom -m Log
message for revision 1. http://192.168.49.21/local_tmp/repos
local_tmp/greekfiles
CMD: svnadmin create repositories/stat_tests-1
CMD: svnadmin dump local_tmp/repos | svnadmin load
repositories/stat_tests-1
CMD: svn co --username apache --password jandom
http://192.168.49.21/repositories/stat_tests-1
working_copies/stat_tests-1
CMD: svn stat foo
PASS: stat_tests.py 1: run status on an unversioned file in the current
directory
CMD: svnadmin create repositories/stat_tests-2
CMD: svnadmin dump local_tmp/repos | svnadmin load
repositories/stat_tests-2
CMD: svn co --username apache --password jandom
http://192.168.49.21/repositories/stat_tests-2
working_copies/stat_tests-2
CMD: svn add working_copies/stat_tests-2/newdir
CMD: svn add working_copies/stat_tests-2/newdir/newfile
svn: warning: 'working_copies/stat_tests-2/newdir/newfile' is already under
revision control
CMD: svn ci -m log msg working_copies/stat_tests-2
CMD: svn status -v -u -q working_copies/stat_tests-2
CMD: svn status -v -u working_copies/stat_tests-2backup
PASS: stat_tests.py 2: run 'status -u' when nested additions are pending
CMD: svnadmin create repositories/stat_tests-3
CMD: svnadmin dump local_tmp/repos | svnadmin load
repositories/stat_tests-3
CMD: svn co --username apache --password jandom
http://192.168.49.21/repositories/stat_tests-3
working_copies/stat_tests-3
CMD: svn stat -vN
PASS: stat_tests.py 3: status -vN and test if all items in the current
directory show up
CMD: svnadmin create repositories/stat_tests-4
CMD: svnadmin dump local_tmp/repos | svnadmin load
repositories/stat_tests-4
CMD: svn co --username apache --password jandom
http://192.168.49.21/repositories/stat_tests-4
working_copies/stat_tests-4
CMD: svn status
PASS: stat_tests.py 4: status with a versioned file missing
CMD: svnadmin create repositories/stat_tests-5
CMD: svnadmin dump local_tmp/repos | svnadmin load
repositories/stat_tests-5
CMD: svn co --username apache --password jandom
http://192.168.49.21/repositories/stat_tests-5
working_copies/stat_tests-5
CMD: svn status
PASS: stat_tests.py 5: status with versioned items whose working type has
changed
CMD: svnadmin create repositories/stat_tests-6
CMD: svnadmin dump local_tmp/repos | svnadmin load
repositories/stat_tests-6
CMD: svn co --username apache --password jandom
http://192.168.49.21/repositories/stat_tests-6
working_copies/stat_tests-6
CMD: svn status
CMD: svn status
PASS: stat_tests.py 6: status with versioned items replaced by symbolic links
CMD: svnadmin create repositories/stat_tests-7
CMD: svnadmin dump local_tmp/repos | svnadmin load
repositories/stat_tests-7
CMD: svn co --username apache --password jandom
http://192.168.49.21/repositories/stat_tests-7
working_copies/stat_tests-7
CMD: svn add newfile
CMD: svn ci -m logmsg
CMD: svn up -r 1
CMD: svn status -u
PASS: stat_tests.py 7: status -u with new files pending in the repository
(tests rev 3686)
CMD: svnadmin create repositories/stat_tests-8
CMD: svnadmin dump local_tmp/repos | svnadmin load
repositories/stat_tests-8
CMD: svn co --username apache --password jandom
http://192.168.49.21/repositories/stat_tests-8
working_copies/stat_tests-8
CMD: svn propset svn:ignore newfile .
CMD: svn status --no-ignore .
PASS: stat_tests.py 8: status blank for unignored file
CMD: svnadmin create repositories/stat_tests-9
CMD: svnadmin dump local_tmp/repos | svnadmin load
repositories/stat_tests-9
CMD: svn co --username apache --password jandom
http://192.168.49.21/repositories/stat_tests-9
working_copies/stat_tests-9
CMD: svn add crontab.root
CMD: svn ci -m log msg
CMD: svn up
CMD: svn ci -m log msg
CMD: svn status -u working_copies/stat_tests-9-other
PASS: stat_tests.py 9: status -u should show that outdated file needs update
CMD: svnadmin create repositories/stat_tests-10
CMD: svnadmin dump local_tmp/repos | svnadmin load
repositories/stat_tests-10
CMD: svn co --username apache --password jandom
http://192.168.49.21/repositories/stat_tests-10
working_copies/stat_tests-10
CMD: svn add newfile
CMD: svn ci -m log msg
CMD: svn add newfile
CMD: svn status -u working_copies/stat_tests-10-other/newfile
XFAIL: stat_tests.py 10: status -u wc/added-and-outdated-file should show
only that status
END: stat_tests.py

START: trans_tests.py
CMD: svnadmin create local_tmp/repos
CMD: svn import --username apache --password jandom -m Log
message for revision 1. http://192.168.49.21/local_tmp/repos
local_tmp/greekfiles
CMD: svnadmin create repositories/trans_tests-1
CMD: svnadmin dump local_tmp/repos | svnadmin load
repositories/trans_tests-1
CMD: svn co --username apache --password jandom
http://192.168.49.21/repositories/trans_tests-1
working_copies/trans_tests-1
CMD: svn add working_copies/trans_tests-1/author_rev_unexp
CMD: svn add working_copies/trans_tests-1/author_rev_exp
CMD: svn add working_copies/trans_tests-1/url_unexp
CMD: svn add working_copies/trans_tests-1/url_exp
CMD: svn add working_copies/trans_tests-1/id_unexp
CMD: svn add working_copies/trans_tests-1/id_exp
CMD: svn add working_copies/trans_tests-1/bogus_keywords
CMD: svn add working_copies/trans_tests-1/embd_author_rev_unexp
CMD: svn add working_copies/trans_tests-1/embd_author_rev_exp
CMD: svn add working_copies/trans_tests-1/embd_bogus_keywords
CMD: svn status -v -u -q working_copies/trans_tests-1
CMD: svn propset svn:keywords Author Rev Date URL Id
working_copies/trans_tests-1/author_rev_unexp
CMD: svn propset svn:keywords Author Rev Date URL Id
working_copies/trans_tests-1/url_unexp
CMD: svn propset svn:keywords Author Rev Date URL Id
working_copies/trans_tests-1/url_exp
CMD: svn propset svn:keywords Author Rev Date URL Id
working_copies/trans_tests-1/id_unexp
CMD: svn propset svn:keywords Author Rev Date URL Id
working_copies/trans_tests-1/id_exp
CMD: svn propset svn:keywords Author Rev Date URL Id
working_copies/trans_tests-1/embd_author_rev_exp
CMD: svn ci -m log msg working_copies/trans_tests-1
PASS: trans_tests.py 1: commit new files with keywords active from birth
XFAIL: trans_tests.py 2: enable translation, check status, commit
XFAIL: trans_tests.py 3: checkout files that have translation enabled
XFAIL: trans_tests.py 4: disable translation, check status, commit
CMD: svnadmin create repositories/trans_tests-5
CMD: svnadmin dump local_tmp/repos | svnadmin load
repositories/trans_tests-5
CMD: svn co --username apache --password jandom
http://192.168.49.21/repositories/trans_tests-5
working_copies/trans_tests-5
CMD: svn propset svn:eol-style native
working_copies/trans_tests-5/A/D/G/rho
CMD: svn ci -m log msg working_copies/trans_tests-5/A/D/G/rho
CMD: svn status -v -u -q working_copies/trans_tests-5
CMD: svn ci -m log msg working_copies/trans_tests-5/A/D/G/rho
CMD: svn status -v -u -q working_copies/trans_tests-5
CMD: svn up -r 1 working_copies/trans_tests-5
PASS: trans_tests.py 5: update locally modified file with eol-style 'native'
END: trans_tests.py

START: svnadmin_tests.py
CMD: svnadmin create local_tmp/repos
CMD: svn import --username apache --password jandom -m Log
message for revision 1. http://192.168.49.21/local_tmp/repos
local_tmp/greekfiles
CMD: svnadmin create repositories/svnadmin_tests-1
CMD: svnadmin dump local_tmp/repos | svnadmin load
repositories/svnadmin_tests-1
CMD: svn co --username apache --password jandom
http://192.168.49.21/repositories/svnadmin_tests-1
working_copies/svnadmin_tests-1
PASS: svnadmin_tests.py 1: test 'svnadmin create' subcommand
CMD: svnadmin create repositories/svnadmin_tests-2
CMD: svnadmin dump local_tmp/repos | svnadmin load
repositories/svnadmin_tests-2
CMD: svn co --username apache --password jandom
http://192.168.49.21/repositories/svnadmin_tests-2
working_copies/svnadmin_tests-2
CMD: svnadmin createtxn repositories/svnadmin_tests-2 -r 1
CMD: svnadmin lstxns repositories/svnadmin_tests-2
PASS: svnadmin_tests.py 2: test 'svnadmin createtxn' subcommand
CMD: svnadmin create repositories/svnadmin_tests-3
CMD: svnadmin dump local_tmp/repos | svnadmin load
repositories/svnadmin_tests-3
CMD: svn co --username apache --password jandom
http://192.168.49.21/repositories/svnadmin_tests-3
working_copies/svnadmin_tests-3
CMD: svnadmin createtxn repositories/svnadmin_tests-3 -r 1
CMD: svnadmin createtxn repositories/svnadmin_tests-3 -r 1
CMD: svnadmin createtxn repositories/svnadmin_tests-3 -r 1
CMD: svnadmin createtxn repositories/svnadmin_tests-3 -r 1
CMD: svnadmin createtxn repositories/svnadmin_tests-3 -r 1
CMD: svnadmin lstxns repositories/svnadmin_tests-3
CMD: svnadmin rmtxns repositories/svnadmin_tests-3 3 5
CMD: svnadmin lstxns repositories/svnadmin_tests-3
PASS: svnadmin_tests.py 3: test 'svnadmin rmtxns' subcommand
CMD: svnadmin create repositories/svnadmin_tests-4
CMD: svnadmin dump local_tmp/repos | svnadmin load
repositories/svnadmin_tests-4
CMD: svn co --username apache --password jandom
http://192.168.49.21/repositories/svnadmin_tests-4
working_copies/svnadmin_tests-4
CMD: svn cp working_copies/svnadmin_tests-4/A/C
working_copies/svnadmin_tests-4/A/B/C
CMD: svn ci working_copies/svnadmin_tests-4 --quiet -m log msg
CMD: svnadmin dump repositories/svnadmin_tests-4
PASS: svnadmin_tests.py 4: test 'svnadmin dump' on a copied directory
CMD: svnadmin create repositories/svnadmin_tests-5
CMD: svnadmin dump local_tmp/repos | svnadmin load
repositories/svnadmin_tests-5
CMD: svn co --username apache --password jandom
http://192.168.49.21/repositories/svnadmin_tests-5
working_copies/svnadmin_tests-5
CMD: svn cp working_copies/svnadmin_tests-5/A/B
working_copies/svnadmin_tests-5/A/Q
CMD: svn ci working_copies/svnadmin_tests-5 --quiet -m log msg
CMD: svnadmin dump repositories/svnadmin_tests-5
PASS: svnadmin_tests.py 5: test 'svnadmin dump' on modified child of
copied directory
END: svnadmin_tests.py

START: svnlook_tests.py
CMD: svnadmin create local_tmp/repos
CMD: svn import --username apache --password jandom -m Log
message for revision 1. http://192.168.49.21/local_tmp/repos
local_tmp/greekfiles
CMD: svnadmin create repositories/svnlook_tests-1
CMD: svnadmin dump local_tmp/repos | svnadmin load
repositories/svnlook_tests-1
CMD: svn co --username apache --password jandom
http://192.168.49.21/repositories/svnlook_tests-1
working_copies/svnlook_tests-1
CMD: svn ci -m log msg working_copies/svnlook_tests-1
CMD: svn status -v -u -q working_copies/svnlook_tests-1
CMD: svnlook youngest repositories/svnlook_tests-1
PASS: svnlook_tests.py 1: test 'svnlook youngest' subcommand
CMD: svnadmin create repositories/svnlook_tests-2
CMD: svnadmin dump local_tmp/repos | svnadmin load
repositories/svnlook_tests-2
CMD: svn co --username apache --password jandom
http://192.168.49.21/repositories/svnlook_tests-2
working_copies/svnlook_tests-2
CMD: svn mv working_copies/svnlook_tests-2/A/B/E
working_copies/svnlook_tests-2/A/B/E2
CMD: svn rm working_copies/svnlook_tests-2/A/B/E2/alpha
CMD: svn ci -m log msg working_copies/svnlook_tests-2
CMD: svn status -v -u -q working_copies/svnlook_tests-2
CMD: svnlook dirs-changed repositories/svnlook_tests-2
XFAIL: svnlook_tests.py 2: delete file in moved dir
END: svnlook_tests.py

START: svnversion_tests.py
CMD: svnadmin create local_tmp/repos
CMD: svn import --username apache --password jandom -m Log
message for revision 1. http://192.168.49.21/local_tmp/repos
local_tmp/greekfiles
CMD: svnadmin create repositories/svnversion_tests-1
CMD: svnadmin dump local_tmp/repos | svnadmin load
repositories/svnversion_tests-1
CMD: svn co --username apache --password jandom
http://192.168.49.21/repositories/svnversion_tests-1
working_copies/svnversion_tests-1
CMD: svnversion working_copies/svnversion_tests-1
http://192.168.49.21/repositories/svnversion_tests-1
CMD: svnversion working_copies/svnversion_tests-1 some/other/url
CMD: svnversion working_copies/svnversion_tests-1
http://192.168.49.21/repositories/svnversion_tests-1
CMD: svn ci -m log msg working_copies/svnversion_tests-1
CMD: svn status -v -u -q working_copies/svnversion_tests-1
CMD: svnversion working_copies/svnversion_tests-1
http://192.168.49.21/repositories/svnversion_tests-1
CMD: svn propset blue azul working_copies/svnversion_tests-1/A/mu
CMD: svnversion working_copies/svnversion_tests-1
http://192.168.49.21/repositories/svnversion_tests-1
CMD: svn switch --username apache --password jandom
http://192.168.49.21/repositories/svnversion_tests-1/A/D/gamma
working_copies/svnversion_tests-1/iota
CMD: svn status -v -u -q working_copies/svnversion_tests-1
CMD: svnversion working_copies/svnversion_tests-1
http://192.168.49.21/repositories/svnversion_tests-1
CMD: svnversion working_copies/svnversion_tests-1/Q
http://192.168.49.21/repositories/svnversion_tests-1
CMD: svnversion working_copies/svnversion_tests-1/Q/X
http://192.168.49.21/repositories/svnversion_tests-1
PASS: svnversion_tests.py 1: test 'svnversion' on a working copy and other
directories
END: svnversion_tests.py

Sent previously

>From tests.log
pass pass
..
PASS: lt-fs-test 20: basic commit
PASS: lt-fs-test 21: copying and tracking copy history
svn: Test failed
svn: XFAIL
XFAIL: lt-fs-test 22: linking, so no copy history
PASS: lt-fs-test 23: merging commit
PASS: lt-fs-test 24: commit datestamps
...
...
START: basic_tests.py
CMD: svnadmin create local_tmp/repos
CMD: svn import --username apache --password jandom -m Log
message
for revision 1. http://localhost/local_tmp/repos local_tmp/greekfiles
svn: RA layer request failed
svn: OPTIONS request failed on /local_tmp/repos
svn: OPTIONS of /local_tmp/repos: could not connect to server
Errors during initial 'svn import':
ACTUAL STDERR:
svn: RA layer request failed
svn: OPTIONS request failed on /local_tmp/repos
svn: OPTIONS of /local_tmp/repos: could not connect to server
caught unexpected exception
Traceback (most recent call last):
  File
/usr/local/src/svn_new/subversion/tests/clients/cmdline/svntest/testcase
.py, line 81, in run
    error = apply(self.pred.func, args)
  File
/usr/local/src/svn_new/subversion/tests/clients/cmdline/basic_tests.py,
 line 54, in basic_checkout
    if sbox.build():
  File
/usr/local/src/svn_new/subversion/tests/clients/cmdline/svntest/main.py
, line 356, in build
    return actions.make_repo_and_wc(self)
  File
/usr/local/src/svn_new/subversion/tests/clients/cmdline/svntest/actions.
py, line 588, in make_repo_and_wc
    guarantee_greek_repository(sbox.repo_dir)
  File
/usr/local/src/svn_new/subversion/tests/clients/cmdline/svntest/actions.
py, line 62, in guarantee_greek_repository
    sys.exit(1)
SystemExit: 1
FAIL: basic_tests.py 1: basic checkout of a wc

------
>From httpd.conf
..
DavLockDB /tmp/DavLock
   Location /repositories
     DAV On
     DAV svn
     SVNParentPath
/usr/local/src/svn_new/subversion/tests/clients/cmdline/repos
itories
   /Location

   Location /local_tmp/repos
     DAV On
     DAV svn
     SVNPath
/usr/local/src/svn_new/subversion/tests/clients/cmdline/local_tmp/r
epos
   /Location

...

running ./basic_tests.py --url=http://localhost from command line also fails..

May be permissions. httpd is running as 'apache'. Some of the files in
local_tmp are owned by 'apache', others by root.

Brute force check

[root@hoho0 cmdline]# chown -R apache *
[root@hoho0 cmdline]# chgrp -R apache *
[root@hoho0 cmdline]# su apache

bash-2.05$ ./basic_tests.py --url=http://localhost
CMD: svnadmin create local_tmp/repos
CMD: svn import --username apache --password jandom -m Log
message
for revision 1. http://localhost/local_tmp/repos local_tmp/greekfiles
svn: RA layer request failed
svn: OPTIONS request failed on /local_tmp/repos
svn: OPTIONS of /local_tmp/repos: could not connect to server
Errors during initial 'svn import':
ACTUAL STDERR:
svn: RA layer request failed
svn: OPTIONS request failed on /local_tmp/repos
svn: OPTIONS of /local_tmp/repos: could not connect to server
...

Still has same errors.

Hmm, but, lookee here

httpd.conf
# Change this to Listen on specific IP addresses as shown below to
# prevent Apache from glomming onto all bound IP addresses (0.0.0.0)
#
#Listen 12.34.56.78:80
# Listen 80
Listen 192.168.49.21:80

Now, if I do
bash-2.05$ ./basic_tests.py --url=http://192.168.49.21
CMD: svnadmin create local_tmp/repos
CMD: svn import --username apache --password jandom -m Log
message
for revision 1. http://192.168.49.21/local_tmp/repos local_tmp/greekfiles
CMD: svnadmin create repositories/basic_tests-1
CMD: svnadmin dump local_tmp/repos | svnadmin load
repositories/basic_tests-1

CMD: svn co --username apache --password jandom
http://192.168.49.21/
repositories/basic_tests-1 working_copies/basic_tests-1
CMD: svn co http://192.168.49.21/repositories/basic_tests-1/A
--username
apache --password jandom working_copies/basic_tests-1
CMD: svn rm working_copies/basic_tests-1/A/D/G
CMD: svn status -v -u -q working_copies/basic_tests-1
Interrupted
bash-2.05$

Seems to be working. I have to run out for a few hours now, will be back
later to run whole test again with the IP substitution for localhost.

Looks good though - thanks much.

BobG

capilato wrote:
Bob Gustafson bobgus@rcnChicago.com writes:

 All of the check, svncheck, davcheck were done with the same apache start.

 But, maybe not after svn 'make install' and before the 'make davcheck'.
 (100MB of error_log was recently blown away..)

 Am redoing 'make davcheck' now.

 Results seem to be the same though

 Running all tests in target-test.py...success
 Running all tests in run-fs-tests.py...success
 Running all tests in run-repos-tests.py...success
 Running all tests in getopt_tests.py...success
 Running all tests in basic_tests.py...FAILURE
 Running all tests in commit_tests.py...FAILURE
 Running all tests in update_tests.py...FAILURE
 Running all tests in switch_tests.py...FAILURE
 Ru...
 ...
 ...

What does tests.log (in the directory you ran the make from) show?
Have you setup your httpd.conf properly for doing dav-based testing
(see the README file in the subversion/tests/clients/cmdline directory)?

---------------------------------------------------------------------
To unsubscribe, e-mail: dev-unsubscribe@subversion.tigris.org
For additional commands, e-mail: dev-help@subversion.tigris.org
Received on Sat Oct 14 02:06:11 2006

This is an archived mail posted to the Subversion Dev mailing list.