[svn.haxx.se] · SVN Dev · SVN Users · SVN Org · TSVN Dev · TSVN Users · Subclipse Dev · Subclipse Users · this month's index

Re: 'make check' Failures, v 1.6.0, x86_64, Centos 5.2

From: Stefan Sperling <stsp_at_elego.de>
Date: Wed, 1 Apr 2009 22:19:06 +0100

On Wed, Apr 01, 2009 at 06:52:27AM -0500, Tom Browder wrote:
> On Wed, Apr 1, 2009 at 4:41 AM, Bert Huijben <bert_at_qqmail.nl> wrote:
> >> -----Original Message-----
> >> From: Tom Browder [mailto:tom.browder{_AT_}gmail.com]
> >> Sent: woensdag 1 april 2009 1:53
> >> To: users_at_subversion.tigris.org
> >> Subject: 'make check' Failures, v 1.6.0, x86_64, Centos 5.2
> ...
> >> However, the x86_64 host running Centos 5.2 had any failures (although
> >> the installation seems to work for sysadmin upgrade, and svn up on at
> >> least one working directory).
> >>
> >> I can attach the test log if there is interest.
> ...
> > Could you send the summary of which tests failed? (And maybe the details of
> > the failed tests?).
>
> Bert, the short summary follows:
>
> Summary of test results:
> 23 tests SKIPPED
> 26 tests XFAILED
> 714 tests FAILED
> make: *** [check] Error 1
>
> I have attached a zipped copy of the stripped down stdoot/stderr with
> just the skipped and failed tests.

This isn't what people were looking for. The file tests.log is what
was meant. Apparently you posted the output of the test run, it just
says tests are failing but not why.

Let me guess where the failures come from:
Did you run out of disk space while running the tests?

Stefan
Received on 2009-04-01 23:20:06 CEST

This is an archived mail posted to the Subversion Users mailing list.