[svn.haxx.se] · SVN Dev · SVN Users · SVN Org · TSVN Dev · TSVN Users · Subclipse Dev · Subclipse Users · this month's index

error on make check 1.4.0 Redhat build

From: Pamela.Ray <Pamela.Ray_at_jpl.nasa.gov>
Date: 2006-11-07 20:59:35 CET

 Hi,
    Any help appreciated, am on RHEL4 - 32 bit, /tps/ is my equivalent
of /usr/local
    Is the problem with my build or with the test script? Built from
src with deps.

Pam

./configure --prefix=/dsw/subversion-1.4.0 --with-openssl -with-swig
--without-berkeley-db \
--with-lib=/tps/lib --with-perl=/tps/bin/perl --with-python=/tps/bin/python
make
make check FS_TYPE=fsfs
....

Running all tests in svnsync_tests.py...FAILURE
Running all tests in authz_tests.py...success
At least one test FAILED, checking /build/subversion-1.4.0/tests.log
FAIL: commit_tests.py 34: post commit hook failure case testing
FAIL: prop_tests.py 11: set, get, and delete a revprop change
FAIL: log_tests.py 12: svn log --xml must not print empty date elements
FAIL: diff_tests.py 38: diff with svn:author that has < in it
FAIL: trans_tests.py 5: keyword expanded on cat
FAIL: svnsync_tests.py 1: copy and modify
FAIL: svnsync_tests.py 2: copy from previous version and modify
FAIL: svnsync_tests.py 3: copy from previous version
FAIL: svnsync_tests.py 4: modified in place
FAIL: svnsync_tests.py 5: tag empty trunk
FAIL: svnsync_tests.py 6: tag trunk containing a sub-directory
FAIL: svnsync_tests.py 7: tag trunk containing a file (#2)
FAIL: svnsync_tests.py 8: tag trunk containing a file
FAIL: svnsync_tests.py 9: tag with a modified file
FAIL: svnsync_tests.py 10: directory property changes
FAIL: svnsync_tests.py 11: files and dirs mixed together
FAIL: svnsync_tests.py 12: copy parent and modify prop
FAIL: svnsync_tests.py 13: detect non-svnsync commits in destination
At least one test was SKIPPED, checking /build/subversion-1.4.0/tests.log
SKIP: utf8_tests.py 1: conversion of paths and logs to/from utf8
SKIP: svnsync_tests.py 14: verify that unreadable content is not synced
SKIP: svnsync_tests.py 15: verify that copies from unreadable dirs work
SKIP: authz_tests.py 1: authz issue #2486 - open root
SKIP: authz_tests.py 2: authz issue #2486 - open directory
SKIP: authz_tests.py 3: broken authz files cause errors
SKIP: authz_tests.py 4: test authz for read operations
SKIP: authz_tests.py 5: test authz for write operations
SKIP: authz_tests.py 6: test authz for checkout
SKIP: authz_tests.py 7: test authz for log and tracing path changes
SKIP: authz_tests.py 8: test authz for checkout and update
SKIP: authz_tests.py 9: test authz for export with unreadable subfolder
make: *** [check] Error 1

-- 
The opinions or comments reflected in this message are my own.
MIST TEAM: Pamela.Ray@jpl.nasa.gov  ph:818-354-7224 cell phone: 1-818-687-8403 
M/S -230-310 fax 1-818-393-???? 
---------------------------------------------------------------------
To unsubscribe, e-mail: users-unsubscribe@subversion.tigris.org
For additional commands, e-mail: users-help@subversion.tigris.org
Received on Tue Nov 7 21:00:20 2006

This is an archived mail posted to the Subversion Users mailing list.