[svn.haxx.se] · SVN Dev · SVN Users · SVN Org · TSVN Dev · TSVN Users · Subclipse Dev · Subclipse Users · this month's index

"make swig-pl" fails on svn-trunk on Mandriva 2007

From: Shlomi Fish <shlomif_at_gmail.com>
Date: 2006-09-13 23:25:43 CEST

Hi all!

make swig-pl fails with the following errors on Mandriva 2007 with the
subversion trunk:

<<<<<<<<<<<
if test "/home/shlomi/progs/svn/SVN-From-Repos/vanilla/trunk/subversion/bindings/swig/perl"
!= "/home/shlomi/progs/svn/SVN-From-Repos/vanilla/trunk/subversion/bindings/swig/perl";
then \
          ln -sf /home/shlomi/progs/svn/SVN-From-Repos/vanilla/trunk/subversion/bindings/swig/perl/native/*.c
/home/shlomi/progs/svn/SVN-From-Repos/vanilla/trunk/subversion/bindings/swig/perl/native;
\
        fi
cd /home/shlomi/progs/svn/SVN-From-Repos/vanilla/trunk/subversion/bindings/swig/perl/native;
make
make[1]: Entering directory
`/home/shlomi/progs/svn/SVN-From-Repos/vanilla/trunk/subversion/bindings/swig/perl/native'
gcc -c -I/usr/local/apps/apache2/include
-I/usr/local/apps/apache2/include -I/usr/local/apps/db-4.2//include
-I../../../../../subversion/bindings/swig/perl/libsvn_swig_perl
-I../../../../../subversion/include -I../../../../..//subversion
-I../../../../../subversion/bindings/swig -g -fno-strict-aliasing
-pipe -Wdeclaration-after-statement -I/usr/local/include
-D_LARGEFILE_SOURCE -D_FILE_OFFSET_BITS=64 -I/usr/include/gdbm -O2
-pipe -Wp,-D_FORTIFY_SOURCE=2 -fexceptions -fomit-frame-pointer
-march=i586 -mtune=pentiumpro -fasynchronous-unwind-tables
-DVERSION=\"\" -DXS_VERSION=\"\" -fPIC
"-I/usr/lib/perl5/5.8.8/i386-linux/CORE" core.c
In file included from /usr/local/apps/apache2/include/apr_pools.h:37,
                 from ../../../../../subversion/include/svn_time.h:25,
                 from core.c:1146:
/usr/local/apps/apache2/include/apr.h:270: error: expected '=', ',',
';', 'asm' or '__attribute__' before 'apr_off_t'
In file included from ../../../../../subversion/include/svn_string.h:71,
                 from ../../../../../subversion/include/svn_props.h:30,
                 from ../../../../../subversion/include/svn_error_codes.h:48,
                 from ../../../../../subversion/include/svn_error.h:48,
                 from ../../../../../subversion/include/svn_time.h:28,
                 from core.c:1146:
/usr/local/apps/apache2/include/apr_strings.h:297: error: expected
declaration specifiers or '...' before 'apr_off_t'
/usr/local/apps/apache2/include/apr_strings.h:313: error: expected ')'
before '*' token
/usr/local/apps/apache2/include/apr_strings.h:349: error: expected ')'
before 'size'
In file included from /usr/local/apps/apache2/include/apr_file_io.h:29,
                 from ../../../../../subversion/include/svn_io.h:30,
                 from ../../../../../subversion/include/svn_delta.h:35,
                 from
../../../../../subversion/bindings/swig/perl/libsvn_swig_perl/swigutil_pl.h:35,
                 from core.c:1150:
/usr/local/apps/apache2/include/apr_file_info.h:204: error: expected
specifier-qualifier-list before 'apr_off_t'
In file included from ../../../../../subversion/include/svn_io.h:30,
                 from ../../../../../subversion/include/svn_delta.h:35,
                 from
../../../../../subversion/bindings/swig/perl/libsvn_swig_perl/swigutil_pl.h:35,
                 from core.c:1150:
/usr/local/apps/apache2/include/apr_file_io.h:548: error: expected
declaration specifiers or '...' before 'apr_off_t'
/usr/local/apps/apache2/include/apr_file_io.h:740: error: expected
declaration specifiers or '...' before 'apr_off_t'
In file included from ../../../../../subversion/include/svn_delta.h:35,
                 from
../../../../../subversion/bindings/swig/perl/libsvn_swig_perl/swigutil_pl.h:35,
                 from core.c:1150:
../../../../../subversion/include/svn_io.h:1023: error: expected
declaration specifiers or '...' before 'apr_off_t'
In file included from ../../../../../subversion/include/svn_wc.h:46,
                 from ../../../../../subversion/include/svn_client.h:38,
                 from
../../../../../subversion/bindings/swig/perl/libsvn_swig_perl/swigutil_pl.h:36,
                 from core.c:1150:
../../../../../subversion/include/svn_ra.h:181: error: expected ')'
before 'progress'
../../../../../subversion/include/svn_ra.h:372: error: expected
specifier-qualifier-list before 'svn_ra_progress_notify_func_t'
In file included from ../../../../../subversion/include/svn_client.h:44,
                 from
../../../../../subversion/bindings/swig/perl/libsvn_swig_perl/swigutil_pl.h:36,
                 from core.c:1150:
../../../../../subversion/include/svn_diff.h:221: error: expected
declaration specifiers or '...' before 'apr_off_t'
../../../../../subversion/include/svn_diff.h:222: error: expected
declaration specifiers or '...' before 'apr_off_t'
../../../../../subversion/include/svn_diff.h:223: error: expected
declaration specifiers or '...' before 'apr_off_t'
../../../../../subversion/include/svn_diff.h:224: error: expected
declaration specifiers or '...' before 'apr_off_t'
../../../../../subversion/include/svn_diff.h:225: error: expected
declaration specifiers or '...' before 'apr_off_t'
../../../../../subversion/include/svn_diff.h:226: error: expected
declaration specifiers or '...' before 'apr_off_t'
../../../../../subversion/include/svn_diff.h:240: error: expected
declaration specifiers or '...' before 'apr_off_t'
../../../../../subversion/include/svn_diff.h:241: error: expected
declaration specifiers or '...' before 'apr_off_t'
../../../../../subversion/include/svn_diff.h:242: error: expected
declaration specifiers or '...' before 'apr_off_t'
../../../../../subversion/include/svn_diff.h:243: error: expected
declaration specifiers or '...' before 'apr_off_t'
../../../../../subversion/include/svn_diff.h:244: error: expected
declaration specifiers or '...' before 'apr_off_t'
../../../../../subversion/include/svn_diff.h:245: error: expected
declaration specifiers or '...' before 'apr_off_t'
../../../../../subversion/include/svn_diff.h:254: error: expected
declaration specifiers or '...' before 'apr_off_t'
../../../../../subversion/include/svn_diff.h:255: error: expected
declaration specifiers or '...' before 'apr_off_t'
../../../../../subversion/include/svn_diff.h:256: error: expected
declaration specifiers or '...' before 'apr_off_t'
../../../../../subversion/include/svn_diff.h:257: error: expected
declaration specifiers or '...' before 'apr_off_t'
../../../../../subversion/include/svn_diff.h:258: error: expected
declaration specifiers or '...' before 'apr_off_t'
../../../../../subversion/include/svn_diff.h:259: error: expected
declaration specifiers or '...' before 'apr_off_t'
../../../../../subversion/include/svn_diff.h:266: error: expected
declaration specifiers or '...' before 'apr_off_t'
../../../../../subversion/include/svn_diff.h:267: error: expected
declaration specifiers or '...' before 'apr_off_t'
../../../../../subversion/include/svn_diff.h:268: error: expected
declaration specifiers or '...' before 'apr_off_t'
../../../../../subversion/include/svn_diff.h:269: error: expected
declaration specifiers or '...' before 'apr_off_t'
../../../../../subversion/include/svn_diff.h:270: error: expected
declaration specifiers or '...' before 'apr_off_t'
../../../../../subversion/include/svn_diff.h:271: error: expected
declaration specifiers or '...' before 'apr_off_t'
../../../../../subversion/include/svn_diff.h:283: error: expected
declaration specifiers or '...' before 'apr_off_t'
../../../../../subversion/include/svn_diff.h:284: error: expected
declaration specifiers or '...' before 'apr_off_t'
../../../../../subversion/include/svn_diff.h:285: error: expected
declaration specifiers or '...' before 'apr_off_t'
../../../../../subversion/include/svn_diff.h:286: error: expected
declaration specifiers or '...' before 'apr_off_t'
../../../../../subversion/include/svn_diff.h:287: error: expected
declaration specifiers or '...' before 'apr_off_t'
../../../../../subversion/include/svn_diff.h:288: error: expected
declaration specifiers or '...' before 'apr_off_t'
In file included from
../../../../../subversion/bindings/swig/perl/libsvn_swig_perl/swigutil_pl.h:36,
                 from core.c:1150:
../../../../../subversion/include/svn_client.h:634: error: expected
specifier-qualifier-list before 'svn_ra_progress_notify_func_t'
In file included from
../../../../../subversion/bindings/swig/perl/libsvn_swig_perl/swigutil_pl.h:38,
                 from core.c:1150:
../../../../..//subversion/svn_private_config.h:156:1: warning: "_" redefined
In file included from /usr/lib/perl5/5.8.8/i386-linux/CORE/perl.h:37,
                 from core.c:519:
/usr/lib/perl5/5.8.8/i386-linux/CORE/config.h:3808:1: warning: this is
the location of the previous definition
core.c:1393: error: expected declaration specifiers or '...' before 'apr_off_t'
core.c:1393: error: expected declaration specifiers or '...' before 'apr_off_t'
core.c:1393: error: expected declaration specifiers or '...' before 'apr_off_t'
core.c:1393: error: expected declaration specifiers or '...' before 'apr_off_t'
core.c:1393: error: expected declaration specifiers or '...' before 'apr_off_t'
core.c:1393: error: expected declaration specifiers or '...' before 'apr_off_t'
core.c: In function 'svn_diff_output_fns_invoke_output_common':
core.c:1394: error: 'original_start' undeclared (first use in this function)
core.c:1394: error: (Each undeclared identifier is reported only once
core.c:1394: error: for each function it appears in.)
core.c:1394: error: 'original_length' undeclared (first use in this function)
core.c:1394: error: 'modified_start' undeclared (first use in this function)
core.c:1394: error: 'modified_length' undeclared (first use in this function)
core.c:1394: error: 'latest_start' undeclared (first use in this function)
core.c:1394: error: 'latest_length' undeclared (first use in this function)
core.c:1394: error: too many arguments to function '_obj->output_common'
core.c: At top level:
core.c:1398: error: expected declaration specifiers or '...' before 'apr_off_t'
core.c:1398: error: expected declaration specifiers or '...' before 'apr_off_t'
core.c:1398: error: expected declaration specifiers or '...' before 'apr_off_t'
core.c:1398: error: expected declaration specifiers or '...' before 'apr_off_t'
core.c:1398: error: expected declaration specifiers or '...' before 'apr_off_t'
core.c:1398: error: expected declaration specifiers or '...' before 'apr_off_t'
core.c: In function 'svn_diff_output_fns_invoke_output_diff_modified':
core.c:1399: error: 'original_start' undeclared (first use in this function)
core.c:1399: error: 'original_length' undeclared (first use in this function)
core.c:1399: error: 'modified_start' undeclared (first use in this function)
core.c:1399: error: 'modified_length' undeclared (first use in this function)
core.c:1399: error: 'latest_start' undeclared (first use in this function)
core.c:1399: error: 'latest_length' undeclared (first use in this function)
core.c:1399: error: too many arguments to function '_obj->output_diff_modified'
core.c: At top level:
core.c:1403: error: expected declaration specifiers or '...' before 'apr_off_t'
core.c:1403: error: expected declaration specifiers or '...' before 'apr_off_t'
core.c:1403: error: expected declaration specifiers or '...' before 'apr_off_t'
core.c:1403: error: expected declaration specifiers or '...' before 'apr_off_t'
core.c:1403: error: expected declaration specifiers or '...' before 'apr_off_t'
core.c:1403: error: expected declaration specifiers or '...' before 'apr_off_t'
core.c: In function 'svn_diff_output_fns_invoke_output_diff_latest':
core.c:1404: error: 'original_start' undeclared (first use in this function)
core.c:1404: error: 'original_length' undeclared (first use in this function)
core.c:1404: error: 'modified_start' undeclared (first use in this function)
core.c:1404: error: 'modified_length' undeclared (first use in this function)
core.c:1404: error: 'latest_start' undeclared (first use in this function)
core.c:1404: error: 'latest_length' undeclared (first use in this function)
core.c:1404: error: too many arguments to function '_obj->output_diff_latest'
core.c: At top level:
core.c:1408: error: expected declaration specifiers or '...' before 'apr_off_t'
core.c:1408: error: expected declaration specifiers or '...' before 'apr_off_t'
core.c:1408: error: expected declaration specifiers or '...' before 'apr_off_t'
core.c:1408: error: expected declaration specifiers or '...' before 'apr_off_t'
core.c:1408: error: expected declaration specifiers or '...' before 'apr_off_t'
core.c:1408: error: expected declaration specifiers or '...' before 'apr_off_t'
core.c: In function 'svn_diff_output_fns_invoke_output_diff_common':
core.c:1409: error: 'original_start' undeclared (first use in this function)
core.c:1409: error: 'original_length' undeclared (first use in this function)
core.c:1409: error: 'modified_start' undeclared (first use in this function)
core.c:1409: error: 'modified_length' undeclared (first use in this function)
core.c:1409: error: 'latest_start' undeclared (first use in this function)
core.c:1409: error: 'latest_length' undeclared (first use in this function)
core.c:1409: error: too many arguments to function '_obj->output_diff_common'
core.c: At top level:
core.c:1413: error: expected declaration specifiers or '...' before 'apr_off_t'
core.c:1413: error: expected declaration specifiers or '...' before 'apr_off_t'
core.c:1413: error: expected declaration specifiers or '...' before 'apr_off_t'
core.c:1413: error: expected declaration specifiers or '...' before 'apr_off_t'
core.c:1413: error: expected declaration specifiers or '...' before 'apr_off_t'
core.c:1413: error: expected declaration specifiers or '...' before 'apr_off_t'
core.c: In function 'svn_diff_output_fns_invoke_output_conflict':
core.c:1414: error: 'original_start' undeclared (first use in this function)
core.c:1414: error: 'original_length' undeclared (first use in this function)
core.c:1414: error: 'modified_start' undeclared (first use in this function)
core.c:1414: error: 'modified_length' undeclared (first use in this function)
core.c:1414: error: 'latest_start' undeclared (first use in this function)
core.c:1414: error: 'latest_length' undeclared (first use in this function)
core.c:1414: error: too many arguments to function '_obj->output_conflict'
core.c: In function '_wrap_svn_diff_output_fns_t_output_common_set':
core.c:15987: error: expected declaration specifiers or '...' before 'apr_off_t'
core.c:15987: error: expected declaration specifiers or '...' before 'apr_off_t'
core.c:15987: error: expected declaration specifiers or '...' before 'apr_off_t'
core.c:15987: error: expected declaration specifiers or '...' before 'apr_off_t'
core.c:15987: error: expected declaration specifiers or '...' before 'apr_off_t'
core.c:15987: error: expected declaration specifiers or '...' before 'apr_off_t'
core.c:15987: error: expected declaration specifiers or '...' before 'apr_off_t'
core.c:15987: error: expected declaration specifiers or '...' before 'apr_off_t'
core.c:15987: error: expected declaration specifiers or '...' before 'apr_off_t'
core.c:15987: error: expected declaration specifiers or '...' before 'apr_off_t'
core.c:15987: error: expected declaration specifiers or '...' before 'apr_off_t'
core.c:15987: error: expected declaration specifiers or '...' before 'apr_off_t'
core.c: In function '_wrap_svn_diff_output_fns_t_output_common_get':
core.c:16018: error: expected declaration specifiers or '...' before 'apr_off_t'
core.c:16018: error: expected declaration specifiers or '...' before 'apr_off_t'
core.c:16018: error: expected declaration specifiers or '...' before 'apr_off_t'
core.c:16018: error: expected declaration specifiers or '...' before 'apr_off_t'
core.c:16018: error: expected declaration specifiers or '...' before 'apr_off_t'
core.c:16018: error: expected declaration specifiers or '...' before 'apr_off_t'
core.c:16030: error: expected declaration specifiers or '...' before 'apr_off_t'
core.c:16030: error: expected declaration specifiers or '...' before 'apr_off_t'
core.c:16030: error: expected declaration specifiers or '...' before 'apr_off_t'
core.c:16030: error: expected declaration specifiers or '...' before 'apr_off_t'
core.c:16030: error: expected declaration specifiers or '...' before 'apr_off_t'
core.c:16030: error: expected declaration specifiers or '...' before 'apr_off_t'
core.c: In function '_wrap_svn_diff_output_fns_t_output_diff_modified_set':
core.c:16045: error: expected declaration specifiers or '...' before 'apr_off_t'
core.c:16045: error: expected declaration specifiers or '...' before 'apr_off_t'
core.c:16045: error: expected declaration specifiers or '...' before 'apr_off_t'
core.c:16045: error: expected declaration specifiers or '...' before 'apr_off_t'
core.c:16045: error: expected declaration specifiers or '...' before 'apr_off_t'
core.c:16045: error: expected declaration specifiers or '...' before 'apr_off_t'
core.c:16045: error: expected declaration specifiers or '...' before 'apr_off_t'
core.c:16045: error: expected declaration specifiers or '...' before 'apr_off_t'
core.c:16045: error: expected declaration specifiers or '...' before 'apr_off_t'
core.c:16045: error: expected declaration specifiers or '...' before 'apr_off_t'
core.c:16045: error: expected declaration specifiers or '...' before 'apr_off_t'
core.c:16045: error: expected declaration specifiers or '...' before 'apr_off_t'
core.c: In function '_wrap_svn_diff_output_fns_t_output_diff_modified_get':
core.c:16076: error: expected declaration specifiers or '...' before 'apr_off_t'
core.c:16076: error: expected declaration specifiers or '...' before 'apr_off_t'
core.c:16076: error: expected declaration specifiers or '...' before 'apr_off_t'
core.c:16076: error: expected declaration specifiers or '...' before 'apr_off_t'
core.c:16076: error: expected declaration specifiers or '...' before 'apr_off_t'
core.c:16076: error: expected declaration specifiers or '...' before 'apr_off_t'
core.c:16088: error: expected declaration specifiers or '...' before 'apr_off_t'
core.c:16088: error: expected declaration specifiers or '...' before 'apr_off_t'
core.c:16088: error: expected declaration specifiers or '...' before 'apr_off_t'
core.c:16088: error: expected declaration specifiers or '...' before 'apr_off_t'
core.c:16088: error: expected declaration specifiers or '...' before 'apr_off_t'
core.c:16088: error: expected declaration specifiers or '...' before 'apr_off_t'
core.c: In function '_wrap_svn_diff_output_fns_t_output_diff_latest_set':
core.c:16103: error: expected declaration specifiers or '...' before 'apr_off_t'
core.c:16103: error: expected declaration specifiers or '...' before 'apr_off_t'
core.c:16103: error: expected declaration specifiers or '...' before 'apr_off_t'
core.c:16103: error: expected declaration specifiers or '...' before 'apr_off_t'
core.c:16103: error: expected declaration specifiers or '...' before 'apr_off_t'
core.c:16103: error: expected declaration specifiers or '...' before 'apr_off_t'
core.c:16103: error: expected declaration specifiers or '...' before 'apr_off_t'
core.c:16103: error: expected declaration specifiers or '...' before 'apr_off_t'
core.c:16103: error: expected declaration specifiers or '...' before 'apr_off_t'
core.c:16103: error: expected declaration specifiers or '...' before 'apr_off_t'
core.c:16103: error: expected declaration specifiers or '...' before 'apr_off_t'
core.c:16103: error: expected declaration specifiers or '...' before 'apr_off_t'
core.c: In function '_wrap_svn_diff_output_fns_t_output_diff_latest_get':
core.c:16134: error: expected declaration specifiers or '...' before 'apr_off_t'
core.c:16134: error: expected declaration specifiers or '...' before 'apr_off_t'
core.c:16134: error: expected declaration specifiers or '...' before 'apr_off_t'
core.c:16134: error: expected declaration specifiers or '...' before 'apr_off_t'
core.c:16134: error: expected declaration specifiers or '...' before 'apr_off_t'
core.c:16134: error: expected declaration specifiers or '...' before 'apr_off_t'
core.c:16146: error: expected declaration specifiers or '...' before 'apr_off_t'
core.c:16146: error: expected declaration specifiers or '...' before 'apr_off_t'
core.c:16146: error: expected declaration specifiers or '...' before 'apr_off_t'
core.c:16146: error: expected declaration specifiers or '...' before 'apr_off_t'
core.c:16146: error: expected declaration specifiers or '...' before 'apr_off_t'
core.c:16146: error: expected declaration specifiers or '...' before 'apr_off_t'
core.c: In function '_wrap_svn_diff_output_fns_t_output_diff_common_set':
core.c:16161: error: expected declaration specifiers or '...' before 'apr_off_t'
core.c:16161: error: expected declaration specifiers or '...' before 'apr_off_t'
core.c:16161: error: expected declaration specifiers or '...' before 'apr_off_t'
core.c:16161: error: expected declaration specifiers or '...' before 'apr_off_t'
core.c:16161: error: expected declaration specifiers or '...' before 'apr_off_t'
core.c:16161: error: expected declaration specifiers or '...' before 'apr_off_t'
core.c:16161: error: expected declaration specifiers or '...' before 'apr_off_t'
core.c:16161: error: expected declaration specifiers or '...' before 'apr_off_t'
core.c:16161: error: expected declaration specifiers or '...' before 'apr_off_t'
core.c:16161: error: expected declaration specifiers or '...' before 'apr_off_t'
core.c:16161: error: expected declaration specifiers or '...' before 'apr_off_t'
core.c:16161: error: expected declaration specifiers or '...' before 'apr_off_t'
core.c: In function '_wrap_svn_diff_output_fns_t_output_diff_common_get':
core.c:16192: error: expected declaration specifiers or '...' before 'apr_off_t'
core.c:16192: error: expected declaration specifiers or '...' before 'apr_off_t'
core.c:16192: error: expected declaration specifiers or '...' before 'apr_off_t'
core.c:16192: error: expected declaration specifiers or '...' before 'apr_off_t'
core.c:16192: error: expected declaration specifiers or '...' before 'apr_off_t'
core.c:16192: error: expected declaration specifiers or '...' before 'apr_off_t'
core.c:16204: error: expected declaration specifiers or '...' before 'apr_off_t'
core.c:16204: error: expected declaration specifiers or '...' before 'apr_off_t'
core.c:16204: error: expected declaration specifiers or '...' before 'apr_off_t'
core.c:16204: error: expected declaration specifiers or '...' before 'apr_off_t'
core.c:16204: error: expected declaration specifiers or '...' before 'apr_off_t'
core.c:16204: error: expected declaration specifiers or '...' before 'apr_off_t'
core.c: In function '_wrap_svn_diff_output_fns_t_output_conflict_set':
core.c:16219: error: expected declaration specifiers or '...' before 'apr_off_t'
core.c:16219: error: expected declaration specifiers or '...' before 'apr_off_t'
core.c:16219: error: expected declaration specifiers or '...' before 'apr_off_t'
core.c:16219: error: expected declaration specifiers or '...' before 'apr_off_t'
core.c:16219: error: expected declaration specifiers or '...' before 'apr_off_t'
core.c:16219: error: expected declaration specifiers or '...' before 'apr_off_t'
core.c:16219: error: expected declaration specifiers or '...' before 'apr_off_t'
core.c:16219: error: expected declaration specifiers or '...' before 'apr_off_t'
core.c:16219: error: expected declaration specifiers or '...' before 'apr_off_t'
core.c:16219: error: expected declaration specifiers or '...' before 'apr_off_t'
core.c:16219: error: expected declaration specifiers or '...' before 'apr_off_t'
core.c:16219: error: expected declaration specifiers or '...' before 'apr_off_t'
core.c: In function '_wrap_svn_diff_output_fns_t_output_conflict_get':
core.c:16250: error: expected declaration specifiers or '...' before 'apr_off_t'
core.c:16250: error: expected declaration specifiers or '...' before 'apr_off_t'
core.c:16250: error: expected declaration specifiers or '...' before 'apr_off_t'
core.c:16250: error: expected declaration specifiers or '...' before 'apr_off_t'
core.c:16250: error: expected declaration specifiers or '...' before 'apr_off_t'
core.c:16250: error: expected declaration specifiers or '...' before 'apr_off_t'
core.c:16262: error: expected declaration specifiers or '...' before 'apr_off_t'
core.c:16262: error: expected declaration specifiers or '...' before 'apr_off_t'
core.c:16262: error: expected declaration specifiers or '...' before 'apr_off_t'
core.c:16262: error: expected declaration specifiers or '...' before 'apr_off_t'
core.c:16262: error: expected declaration specifiers or '...' before 'apr_off_t'
core.c:16262: error: expected declaration specifiers or '...' before 'apr_off_t'
core.c: In function '_wrap_svn_diff_fns_invoke_datasource_get_next_token':
core.c:17388: warning: assignment from incompatible pointer type
core.c: In function '_wrap_svn_diff_output_fns_invoke_output_common':
core.c:17603: error: 'apr_off_t' undeclared (first use in this function)
core.c:17603: error: expected ';' before 'arg3'
core.c:17604: error: expected ';' before 'arg4'
core.c:17605: error: expected ';' before 'arg5'
core.c:17606: error: expected ';' before 'arg6'
core.c:17607: error: expected ';' before 'arg7'
core.c:17608: error: expected ';' before 'arg8'
core.c:17609: warning: ISO C90 forbids mixed declarations and code
core.c:17626: error: 'arg3' undeclared (first use in this function)
core.c:17626: error: expected ';' before 'strtoll'
core.c:17627: error: 'arg4' undeclared (first use in this function)
core.c:17627: error: expected ';' before 'strtoll'
core.c:17628: error: 'arg5' undeclared (first use in this function)
core.c:17628: error: expected ';' before 'strtoll'
core.c:17629: error: 'arg6' undeclared (first use in this function)
core.c:17629: error: expected ';' before 'strtoll'
core.c:17630: error: 'arg7' undeclared (first use in this function)
core.c:17630: error: expected ';' before 'strtoll'
core.c:17631: error: 'arg8' undeclared (first use in this function)
core.c:17631: error: expected ';' before 'strtoll'
core.c:17633: error: too many arguments to function
'svn_diff_output_fns_invoke_output_common'
core.c: In function '_wrap_svn_diff_output_fns_invoke_output_diff_modified':
core.c:17667: error: 'apr_off_t' undeclared (first use in this function)
core.c:17667: error: expected ';' before 'arg3'
core.c:17668: error: expected ';' before 'arg4'
core.c:17669: error: expected ';' before 'arg5'
core.c:17670: error: expected ';' before 'arg6'
core.c:17671: error: expected ';' before 'arg7'
core.c:17672: error: expected ';' before 'arg8'
core.c:17673: warning: ISO C90 forbids mixed declarations and code
core.c:17690: error: 'arg3' undeclared (first use in this function)
core.c:17690: error: expected ';' before 'strtoll'
core.c:17691: error: 'arg4' undeclared (first use in this function)
core.c:17691: error: expected ';' before 'strtoll'
core.c:17692: error: 'arg5' undeclared (first use in this function)
core.c:17692: error: expected ';' before 'strtoll'
core.c:17693: error: 'arg6' undeclared (first use in this function)
core.c:17693: error: expected ';' before 'strtoll'
core.c:17694: error: 'arg7' undeclared (first use in this function)
core.c:17694: error: expected ';' before 'strtoll'
core.c:17695: error: 'arg8' undeclared (first use in this function)
core.c:17695: error: expected ';' before 'strtoll'
core.c:17697: error: too many arguments to function
'svn_diff_output_fns_invoke_output_diff_modified'
core.c: In function '_wrap_svn_diff_output_fns_invoke_output_diff_latest':
core.c:17731: error: 'apr_off_t' undeclared (first use in this function)
core.c:17731: error: expected ';' before 'arg3'
core.c:17732: error: expected ';' before 'arg4'
core.c:17733: error: expected ';' before 'arg5'
core.c:17734: error: expected ';' before 'arg6'
core.c:17735: error: expected ';' before 'arg7'
core.c:17736: error: expected ';' before 'arg8'
core.c:17737: warning: ISO C90 forbids mixed declarations and code
core.c:17754: error: 'arg3' undeclared (first use in this function)
core.c:17754: error: expected ';' before 'strtoll'
core.c:17755: error: 'arg4' undeclared (first use in this function)
core.c:17755: error: expected ';' before 'strtoll'
core.c:17756: error: 'arg5' undeclared (first use in this function)
core.c:17756: error: expected ';' before 'strtoll'
core.c:17757: error: 'arg6' undeclared (first use in this function)
core.c:17757: error: expected ';' before 'strtoll'
core.c:17758: error: 'arg7' undeclared (first use in this function)
core.c:17758: error: expected ';' before 'strtoll'
core.c:17759: error: 'arg8' undeclared (first use in this function)
core.c:17759: error: expected ';' before 'strtoll'
core.c:17761: error: too many arguments to function
'svn_diff_output_fns_invoke_output_diff_latest'
core.c: In function '_wrap_svn_diff_output_fns_invoke_output_diff_common':
core.c:17795: error: 'apr_off_t' undeclared (first use in this function)
core.c:17795: error: expected ';' before 'arg3'
core.c:17796: error: expected ';' before 'arg4'
core.c:17797: error: expected ';' before 'arg5'
core.c:17798: error: expected ';' before 'arg6'
core.c:17799: error: expected ';' before 'arg7'
core.c:17800: error: expected ';' before 'arg8'
core.c:17801: warning: ISO C90 forbids mixed declarations and code
core.c:17818: error: 'arg3' undeclared (first use in this function)
core.c:17818: error: expected ';' before 'strtoll'
core.c:17819: error: 'arg4' undeclared (first use in this function)
core.c:17819: error: expected ';' before 'strtoll'
core.c:17820: error: 'arg5' undeclared (first use in this function)
core.c:17820: error: expected ';' before 'strtoll'
core.c:17821: error: 'arg6' undeclared (first use in this function)
core.c:17821: error: expected ';' before 'strtoll'
core.c:17822: error: 'arg7' undeclared (first use in this function)
core.c:17822: error: expected ';' before 'strtoll'
core.c:17823: error: 'arg8' undeclared (first use in this function)
core.c:17823: error: expected ';' before 'strtoll'
core.c:17825: error: too many arguments to function
'svn_diff_output_fns_invoke_output_diff_common'
core.c: In function '_wrap_svn_diff_output_fns_invoke_output_conflict':
core.c:17859: error: 'apr_off_t' undeclared (first use in this function)
core.c:17859: error: expected ';' before 'arg3'
core.c:17860: error: expected ';' before 'arg4'
core.c:17861: error: expected ';' before 'arg5'
core.c:17862: error: expected ';' before 'arg6'
core.c:17863: error: expected ';' before 'arg7'
core.c:17864: error: expected ';' before 'arg8'
core.c:17865: warning: ISO C90 forbids mixed declarations and code
core.c:17883: error: 'arg3' undeclared (first use in this function)
core.c:17883: error: expected ';' before 'strtoll'
core.c:17884: error: 'arg4' undeclared (first use in this function)
core.c:17884: error: expected ';' before 'strtoll'
core.c:17885: error: 'arg5' undeclared (first use in this function)
core.c:17885: error: expected ';' before 'strtoll'
core.c:17886: error: 'arg6' undeclared (first use in this function)
core.c:17886: error: expected ';' before 'strtoll'
core.c:17887: error: 'arg7' undeclared (first use in this function)
core.c:17887: error: expected ';' before 'strtoll'
core.c:17888: error: 'arg8' undeclared (first use in this function)
core.c:17888: error: expected ';' before 'strtoll'
core.c:17895: error: too many arguments to function
'svn_diff_output_fns_invoke_output_conflict'
make[1]: *** [core.o] Error 1
make[1]: Leaving directory
`/home/shlomi/progs/svn/SVN-From-Repos/vanilla/trunk/subversion/bindings/swig/perl/native'
make: *** [swig-pl] Error 2
>>>>>>>>>>>

Regards,

        Shlomi Fish

------------------------------------------
Shlomi Fish http://www.shlomifish.org/

If his programming is anything like his philosophising, he
would find 10 imaginary bugs in the "Hello World" program.

---------------------------------------------------------------------
To unsubscribe, e-mail: users-unsubscribe@subversion.tigris.org
For additional commands, e-mail: users-help@subversion.tigris.org
Received on Wed Sep 13 23:26:25 2006

This is an archived mail posted to the Subversion Users mailing list.