[svn.haxx.se] · SVN Dev · SVN Users · SVN Org · TSVN Dev · TSVN Users · Subclipse Dev · Subclipse Users · this month's index

Re: 1.7.1 up for testing / signing

From: rupert.thurner <rupert.thurner_at_gmail.com>
Date: Sun, 18 Dec 2011 02:35:39 -0800 (PST)

On Oct 21, 9:51 am, Stefan Sperling <s..._at_elego.de> wrote:
> On Thu, Oct 20, 2011 at 04:19:08PM -0700, rupert.thurner wrote:
> > on solaris, one test is failing for 1.7.0 ...
> > At least one test FAILED, checking /home/rupert/mgar-sav/pkg/
> > subversion/trunk/work/solaris9-sparc/build-isa-sparcv8/
> > subversion-1.7.0/tests.log
> > FAIL:  copy_tests.py 86:changeddiraftercommitshouldmatch
> >checkout
> > Summary of test results:
> >   1552 tests PASSED
> >   42 tests SKIPPED
> >   23 tests XFAILED (1 WORK-IN-PROGRESS)
> >   1 test FAILED
> > gmake: *** [check] Error 1
>
> Please show the output of:
>
> $ cd /home/rupert/mgar-sav/pkg/subversion/trunk/work/solaris9-sparc/build-isa-sp arcv8/subversion-1.7.0/subversion/tests/cmdline
> $ ./copy_tests.py 86 --verbose

rupert @ unstable9s : ~/mgar-sav/pkg/subversion/trunk/work/solaris9-
sparc/build-isa-sparcv8/subversion-1.7.2/subversion/tests/cmdline
$ ./copy_tests.py 86 --verbose
CMD: svnadmin create svn-test-work/local_tmp/repos --bdb-txn-nosync
<TIME = 0.761797>
CMD: svn import -m 'Log message for revision 1.' svn-test-work/
local_tmp/greekfiles
file:///home/rupert/mgar-sav/pkg/subversion/trunk/work/solaris9-sparc/build-isa-sparcv8/subversion-1.7.2/subversion/tests/cmdline/svn-test-work/local_tmp/repos
--config-dir /home/rupert/mgar-sav/pkg/subversion/trunk/work/solaris9-
sparc/build-isa-sparcv8/subversion-1.7.2/subversion/tests/cmdline/svn-
test-work/local_tmp/config --password rayjandom --no-auth-cache --
username jrandom
<TIME = 2.227990>
Adding svn-test-work/local_tmp/greekfiles/A
Adding svn-test-work/local_tmp/greekfiles/A/mu
Adding svn-test-work/local_tmp/greekfiles/A/B
Adding svn-test-work/local_tmp/greekfiles/A/B/lambda
Adding svn-test-work/local_tmp/greekfiles/A/B/E
Adding svn-test-work/local_tmp/greekfiles/A/B/E/alpha
Adding svn-test-work/local_tmp/greekfiles/A/B/E/beta
Adding svn-test-work/local_tmp/greekfiles/A/B/F
Adding svn-test-work/local_tmp/greekfiles/A/C
Adding svn-test-work/local_tmp/greekfiles/A/D
Adding svn-test-work/local_tmp/greekfiles/A/D/gamma
Adding svn-test-work/local_tmp/greekfiles/A/D/G
Adding svn-test-work/local_tmp/greekfiles/A/D/G/pi
Adding svn-test-work/local_tmp/greekfiles/A/D/G/rho
Adding svn-test-work/local_tmp/greekfiles/A/D/G/tau
Adding svn-test-work/local_tmp/greekfiles/A/D/H
Adding svn-test-work/local_tmp/greekfiles/A/D/H/chi
Adding svn-test-work/local_tmp/greekfiles/A/D/H/omega
Adding svn-test-work/local_tmp/greekfiles/A/D/H/psi
Adding svn-test-work/local_tmp/greekfiles/iota

Committed revision 1.
CMD: svnadmin create svn-test-work/repositories/copy_tests-86 --bdb-
txn-nosync
<TIME = 0.585621>
CMD: svnadmin dump svn-test-work/local_tmp/repos | svnadmin load svn-
test-work/repositories/copy_tests-86 --ignore-uuid
<TIME = 0.058278>
CMD: svn co
file:///home/rupert/mgar-sav/pkg/subversion/trunk/work/solaris9-sparc/build-isa-sparcv8/subversion-1.7.2/subversion/tests/cmdline/svn-test-work/repositories/copy_tests-86
svn-test-work/working_copies/copy_tests-86 --config-dir /home/rupert/
mgar-sav/pkg/subversion/trunk/work/solaris9-sparc/build-isa-sparcv8/
subversion-1.7.2/subversion/tests/cmdline/svn-test-work/local_tmp/
config --password rayjandom --no-auth-cache --username jrandom
<TIME = 2.146193>
A svn-test-work/working_copies/copy_tests-86/A
A svn-test-work/working_copies/copy_tests-86/A/B
A svn-test-work/working_copies/copy_tests-86/A/B/lambda
A svn-test-work/working_copies/copy_tests-86/A/B/E
A svn-test-work/working_copies/copy_tests-86/A/B/E/alpha
A svn-test-work/working_copies/copy_tests-86/A/B/E/beta
A svn-test-work/working_copies/copy_tests-86/A/B/F
A svn-test-work/working_copies/copy_tests-86/A/mu
A svn-test-work/working_copies/copy_tests-86/A/C
A svn-test-work/working_copies/copy_tests-86/A/D
A svn-test-work/working_copies/copy_tests-86/A/D/gamma
A svn-test-work/working_copies/copy_tests-86/A/D/G
A svn-test-work/working_copies/copy_tests-86/A/D/G/pi
A svn-test-work/working_copies/copy_tests-86/A/D/G/rho
A svn-test-work/working_copies/copy_tests-86/A/D/G/tau
A svn-test-work/working_copies/copy_tests-86/A/D/H
A svn-test-work/working_copies/copy_tests-86/A/D/H/chi
A svn-test-work/working_copies/copy_tests-86/A/D/H/omega
A svn-test-work/working_copies/copy_tests-86/A/D/H/psi
A svn-test-work/working_copies/copy_tests-86/iota
Checked out revision 1.
CMD: svn copy svn-test-work/working_copies/copy_tests-86/A/B svn-test-
work/working_copies/copy_tests-86/B_new --config-dir /home/rupert/mgar-
sav/pkg/subversion/trunk/work/solaris9-sparc/build-isa-sparcv8/
subversion-1.7.2/subversion/tests/cmdline/svn-test-work/local_tmp/
config --password rayjandom --no-auth-cache --username jrandom
<TIME = 1.736363>
A svn-test-work/working_copies/copy_tests-86/B_new
CMD: svn commit -m 'File '\''./copy_tests.py'\'', line 4643, in
changed_dir_data_should_match_checkout' svn-test-work/working_copies/
copy_tests-86 --config-dir /home/rupert/mgar-sav/pkg/subversion/trunk/
work/solaris9-sparc/build-isa-sparcv8/subversion-1.7.2/subversion/
tests/cmdline/svn-test-work/local_tmp/config --password rayjandom --no-
auth-cache --username jrandom
<TIME = 1.854617>
Adding svn-test-work/working_copies/copy_tests-86/B_new

Committed revision 2.
CMD: svn up svn-test-work/working_copies/copy_tests-86 --config-dir /
home/rupert/mgar-sav/pkg/subversion/trunk/work/solaris9-sparc/build-
isa-sparcv8/subversion-1.7.2/subversion/tests/cmdline/svn-test-work/
local_tmp/config --password rayjandom --no-auth-cache --username
jrandom
<TIME = 1.684379>
Updating 'svn-test-work/working_copies/copy_tests-86':
At revision 2.
CMD: svn co
file:///home/rupert/mgar-sav/pkg/subversion/trunk/work/solaris9-sparc/build-isa-sparcv8/subversion-1.7.2/subversion/tests/cmdline/svn-test-work/repositories/copy_tests-86
svn-test-work/working_copies/copy_tests-86.verify --config-dir /home/
rupert/mgar-sav/pkg/subversion/trunk/work/solaris9-sparc/build-isa-
sparcv8/subversion-1.7.2/subversion/tests/cmdline/svn-test-work/
local_tmp/config --password rayjandom --no-auth-cache --username
jrandom
<TIME = 2.221595>
A svn-test-work/working_copies/copy_tests-86.verify/A
A svn-test-work/working_copies/copy_tests-86.verify/A/B
A svn-test-work/working_copies/copy_tests-86.verify/A/B/lambda
A svn-test-work/working_copies/copy_tests-86.verify/A/B/E
A svn-test-work/working_copies/copy_tests-86.verify/A/B/E/alpha
A svn-test-work/working_copies/copy_tests-86.verify/A/B/E/beta
A svn-test-work/working_copies/copy_tests-86.verify/A/B/F
A svn-test-work/working_copies/copy_tests-86.verify/A/mu
A svn-test-work/working_copies/copy_tests-86.verify/A/C
A svn-test-work/working_copies/copy_tests-86.verify/A/D
A svn-test-work/working_copies/copy_tests-86.verify/A/D/gamma
A svn-test-work/working_copies/copy_tests-86.verify/A/D/G
A svn-test-work/working_copies/copy_tests-86.verify/A/D/G/pi
A svn-test-work/working_copies/copy_tests-86.verify/A/D/G/rho
A svn-test-work/working_copies/copy_tests-86.verify/A/D/G/tau
A svn-test-work/working_copies/copy_tests-86.verify/A/D/H
A svn-test-work/working_copies/copy_tests-86.verify/A/D/H/chi
A svn-test-work/working_copies/copy_tests-86.verify/A/D/H/omega
A svn-test-work/working_copies/copy_tests-86.verify/A/D/H/psi
A svn-test-work/working_copies/copy_tests-86.verify/B_new
A svn-test-work/working_copies/copy_tests-86.verify/B_new/lambda
A svn-test-work/working_copies/copy_tests-86.verify/B_new/E
A svn-test-work/working_copies/copy_tests-86.verify/B_new/E/alpha
A svn-test-work/working_copies/copy_tests-86.verify/B_new/E/beta
A svn-test-work/working_copies/copy_tests-86.verify/B_new/F
A svn-test-work/working_copies/copy_tests-86.verify/iota
Checked out revision 2.
CMD: svn status -v --config-dir /home/rupert/mgar-sav/pkg/subversion/
trunk/work/solaris9-sparc/build-isa-sparcv8/subversion-1.7.2/
subversion/tests/cmdline/svn-test-work/local_tmp/config --password
rayjandom --no-auth-cache --username jrandom
<TIME = 1.632418>
                 2 2 jrandom .
                 2 1 jrandom A
                 2 1 jrandom A/B
                 2 1 jrandom A/B/lambda
                 2 1 jrandom A/B/E
                 2 1 jrandom A/B/E/alpha
                 2 1 jrandom A/B/E/beta
                 2 1 jrandom A/B/F
                 2 1 jrandom A/mu
                 2 1 jrandom A/C
                 2 1 jrandom A/D
                 2 1 jrandom A/D/gamma
                 2 1 jrandom A/D/G
                 2 1 jrandom A/D/G/pi
                 2 1 jrandom A/D/G/rho
                 2 1 jrandom A/D/G/tau
                 2 1 jrandom A/D/H
                 2 1 jrandom A/D/H/chi
                 2 1 jrandom A/D/H/omega
                 2 1 jrandom A/D/H/psi
                 2 2 jrandom B_new
                 2 1 jrandom B_new/lambda
                 2 1 jrandom B_new/E
                 2 1 jrandom B_new/E/alpha
                 2 1 jrandom B_new/E/beta
                 2 1 jrandom B_new/F
                 2 1 jrandom iota
CMD: svn status -v --config-dir /home/rupert/mgar-sav/pkg/subversion/
trunk/work/solaris9-sparc/build-isa-sparcv8/subversion-1.7.2/
subversion/tests/cmdline/svn-test-work/local_tmp/config --password
rayjandom --no-auth-cache --username jrandom
<TIME = 1.617954>
                 2 2 jrandom .
                 2 1 jrandom A
                 2 1 jrandom A/B
                 2 1 jrandom A/B/lambda
                 2 1 jrandom A/B/E
                 2 1 jrandom A/B/E/alpha
                 2 1 jrandom A/B/E/beta
                 2 1 jrandom A/B/F
                 2 1 jrandom A/mu
                 2 1 jrandom A/C
                 2 1 jrandom A/D
                 2 1 jrandom A/D/gamma
                 2 1 jrandom A/D/G
                 2 1 jrandom A/D/G/pi
                 2 1 jrandom A/D/G/rho
                 2 1 jrandom A/D/G/tau
                 2 1 jrandom A/D/H
                 2 1 jrandom A/D/H/chi
                 2 1 jrandom A/D/H/omega
                 2 1 jrandom A/D/H/psi
                 2 2 jrandom B_new
                 2 1 jrandom B_new/lambda
                 2 1 jrandom B_new/E
                 2 1 jrandom B_new/E/alpha
                 2 1 jrandom B_new/E/beta
                 2 1 jrandom B_new/F
                 2 1 jrandom iota
PASS: copy_tests.py 86: changed dir after commit should match
checkout
Received on 2011-12-18 11:36:19 CET

This is an archived mail posted to the Subversion Dev mailing list.