[svn.haxx.se] · SVN Dev · SVN Users · SVN Org · TSVN Dev · TSVN Users · Subclipse Dev · Subclipse Users · this month's index

Re: Ruby bindings on trunk build failure

From: Eric Gillespie <epg_at_pretzelnet.org>
Date: Wed, 30 Jan 2008 21:22:04 -0800

Eric Gillespie <epg_at_pretzelnet.org> writes:

> /opt/pkg/lib/ruby/1.8/i386-linux/ruby.h:672: error: syntax error before 'VALUE'
> /opt/pkg/lib/ruby/1.8/i386-linux/ruby.h:689: error: syntax error before 'int'
> /opt/pkg/lib/ruby/1.8/i386-linux/ruby.h:706: error: syntax error before 'int'
>
> I wonder if there's something wrong with my Ruby installation...

Same errors with the ruby1.8 in Ubuntu Dapper:

/usr/lib/ruby/1.8/i486-linux/ruby.h:631: error: syntax error before 'VALUE'
/usr/lib/ruby/1.8/i486-linux/ruby.h:648: error: syntax error before 'int'
/usr/lib/ruby/1.8/i486-linux/ruby.h:665: error: syntax error before 'int'

-- 
Eric Gillespie <*> epg_at_pretzelnet.org
---------------------------------------------------------------------
To unsubscribe, e-mail: dev-unsubscribe_at_subversion.tigris.org
For additional commands, e-mail: dev-help_at_subversion.tigris.org
Received on 2008-01-31 06:22:13 CET

This is an archived mail posted to the Subversion Dev mailing list.