[svn.haxx.se] · SVN Dev · SVN Users · SVN Org · TSVN Dev · TSVN Users · Subclipse Dev · Subclipse Users · this month's index

Perl/swig test failures in v1.4.2

From: Graham Leggett <minfrin_at_sharp.fm>
Date: 2006-11-29 13:55:21 CET

Hi all,

While attempting to build an RPM of subversion v1.4.2 under RHEL, I got
test failures as below.

Two changes were made to the ./configure line, the first was that
--with-berkleydb was removed, and subversion was built against APR
v1.2.7 instead of v0.9.x.

Does anyone know what these test failures mean?

cd
/home/chandler/minfrin/rpms/build/subversion-1.4.2/subversion/bindings/swig/perl/native;
make test
make[2]: Entering directory
`/home/chandler/minfrin/rpms/build/subversion-1.4.2/subversion/bindings/swig/perl/native'
PERL_DL_NONLAZY=1
LD_LIBRARY_PATH=/home/chandler/minfrin/rpms/build/subversion-1.4.2/subversion/bindings/swig/perl/libsvn_swig_perl/.libs:/home/chandler/minfrin/rpms/build/subversion-1.4.2/subversion/libsvn_client/.libs:/home/chandler/minfrin/rpms/build/subversion-1.4.2/subversion/libsvn_delta/.libs:/home/chandler/minfrin/rpms/build/subversion-1.4.2/subversion/libsvn_fs/.libs:/home/chandler/minfrin/rpms/build/subversion-1.4.2/subversion/libsvn_ra/.libs:/home/chandler/minfrin/rpms/build/subversion-1.4.2/subversion/libsvn_repos/.libs:/home/chandler/minfrin/rpms/build/subversion-1.4.2/subversion/libsvn_wc/.libs:/home/chandler/minfrin/rpms/build/subversion-1.4.2/subversion/libsvn_diff/.libs:/home/chandler/minfrin/rpms/build/subversion-1.4.2/subversion/libsvn_subr/.libs:/home/chandler/minfrin/rpms/build/subversion-1.4.2/subversion/libsvn_ra_local/.libs:/home/chandler/minfrin/rpms/build/subversion-1.4.2/subversion/libsvn_ra_svn/.libs:/home/chandler/minfrin/rpms/build/subversion-1.4.2/subversion/libs
vn_ra_dav/.libs:/home/chandler/minfrin/rpms/build/subversion-1.4.2/subversion/libsvn_fs_base/.libs:/home/chandler/minfrin/rpms/build/subversion-1.4.2/subversion/libsvn_fs_fs/.libs
/usr/bin/perl "-MExtUtils::Command::MM" "-e" "test_harness(0,
'blib/lib', 'blib/arch')"
../../../../../subversion/bindings/swig/perl/native/t/*.t
../../../../../subversion/bindings/swig/perl/native/t/0use.............ok

../../../../../subversion/bindings/swig/perl/native/t/1repos...........ok
1/6# committed 1,2006-11-28T16:23:50.106430Z,root
../../../../../subversion/bindings/swig/perl/native/t/1repos...........ok
2/6# committed 2,2006-11-28T16:23:50.121512Z,root
../../../../../subversion/bindings/swig/perl/native/t/1repos...........ok
4/6# committed 3,2006-11-28T16:23:50.136488Z,root
../../../../../subversion/bindings/swig/perl/native/t/1repos...........ok
6/6# cleanup
../../../../../subversion/bindings/swig/perl/native/t/1repos...........ok

../../../../../subversion/bindings/swig/perl/native/t/2fs..............ok
16/16# cleanup
../../../../../subversion/bindings/swig/perl/native/t/2fs..............ok

../../../../../subversion/bindings/swig/perl/native/t/3client..........NOK
16# Failed test
(../../../../../subversion/bindings/swig/perl/native/t/3client.t at line 80)
# got: '_p_svn_error_t=SCALAR(0x990770)'
# expected: '1'
../../../../../subversion/bindings/swig/perl/native/t/3client..........ok
19/117# Failed test
(../../../../../subversion/bindings/swig/perl/native/t/3client.t at line 96)
# got: ''
# expected: 'mkdir dir1'
../../../../../subversion/bindings/swig/perl/native/t/3client..........ok
100/11../../../../../subversion/bindings/swig/perl/native/t/3client..........ok
101/11../../../../../subversion/bindings/swig/perl/native/t/3client..........ok
102/11../../../../../subversion/bindings/swig/perl/native/t/3client..........ok
103/11../../../../../subversion/bindings/swig/perl/native/t/3client..........ok
104/11../../../../../subversion/bindings/swig/perl/native/t/3client..........ok
105/11../../../../../subversion/bindings/swig/perl/native/t/3client..........ok
106/11../../../../../subversion/bindings/swig/perl/native/t/3client..........ok
107/11../../../../../subversion/bindings/swig/perl/native/t/3client..........ok
108/11../../../../../subversion/bindings/swig/perl/native/t/3client..........ok
109/11../../../../../subversion/bindings/swig/perl/native/t/3client..........ok
110/11../../../../../subversion/bindings/swig/perl/native/t/3client..........ok
111/11../../../../../subversion/bindings/swig/perl/native/t/3client..........ok
112/11../../../../../subversion/bindings/swig/perl/native/t/3client..........ok
113/11../../../../../subversion/bindings/swig/perl/native/t/3client..........ok
114/11../../../../../subversion/bindings/swig/perl/native/t/3client..........ok
115/11../../../../../subversion/bindings/swig/perl/native/t/3client..........ok
116/11../../../../../subversion/bindings/swig/perl/native/t/3client..........ok
117/117# cleanup
# Looks like you failed 2 tests of 117.
../../../../../subversion/bindings/swig/perl/native/t/3client..........dubious
         Test returned status 2 (wstat 512, 0x200)
DIED. FAILED tests 16, 20
         Failed 2/117 tests, 98.29% okay (less 7 skipped tests: 108
okay, 92.31%)
../../../../../subversion/bindings/swig/perl/native/t/4pool............ok
6/6# cleanup
../../../../../subversion/bindings/swig/perl/native/t/4pool............ok

../../../../../subversion/bindings/swig/perl/native/t/5delta-compat....ok

../../../../../subversion/bindings/swig/perl/native/t/5delta...........ok

../../../../../subversion/bindings/swig/perl/native/t/6ra..............ok
7/7# cleanup
../../../../../subversion/bindings/swig/perl/native/t/6ra..............ok

../../../../../subversion/bindings/swig/perl/native/t/7editor..........#
committed 1,2006-11-28T16:23:57.394666Z,root
../../../../../subversion/bindings/swig/perl/native/t/7editor..........ok

../../../../../subversion/bindings/swig/perl/native/t/8lock............ok

Failed Test Stat Wstat Total Fail Failed List of
Failed
-------------------------------------------------------------------------------
../../../../../subversion/binding 2 512 117 2 1.71% 16 20
7 subtests skipped.
Failed 1/10 test scripts, 90.00% okay. 2/173 subtests failed, 98.84% okay.
make[2]: *** [test_dynamic] Error 255
make[2]: Leaving directory
`/home/chandler/minfrin/rpms/build/subversion-1.4.2/subversion/bindings/swig/perl/native'
make[1]: *** [check-swig-pl] Error 2
make[1]: Leaving directory
`/home/chandler/minfrin/rpms/build/subversion-1.4.2'
error: Bad exit status from
/home/chandler/minfrin/rpms/tmp/rpm-tmp.16966 (%build)

Regards,
Graham

--

Received on Fri Dec 1 23:05:05 2006

This is an archived mail posted to the Subversion Dev mailing list.