[svn.haxx.se] · SVN Dev · SVN Users · SVN Org · TSVN Dev · TSVN Users · Subclipse Dev · Subclipse Users · this month's index

Re: 1.4.0-rc1 tarballs up for testing/signing

From: Paul Burba <paulb_at_softlanding.com>
Date: 2006-06-21 22:47:21 CEST

David Anderson <david.anderson@calixo.net> wrote on 06/01/2006 02:28:56
PM:

> So, with no further ado, Subversion 1.4.0-rc1, is up for testing and
> signing. The magic revision is r19895.
>
> http://lolut.utbm.info/subversion/1.4.0/rc1/
>
> As usual, signatures from full committers back to me, and enthusiastic
> tester feedback is welcome. However, this RC is not yet blessed for
> wide release, so please don't make it available to people not
> interested in test-driving the new release.
>
> Also, distro package maintainers, please to NOT include any RC builds,
> even blessed, into operating system distros. The reasons for not
> doing so were very eloquently outlined by Karl in a mail, which is
> summarized at the above address.
>
> The quick version is: we don't guarantee compatibility between the RCs
> and the final release, so if people install the RC, all their
> repositories and working copies might break unrepairably when they
> upgrade to 1.4.0 proper. We don't want that kind of bad publicity,
> and neither do you.
>
> Have fun!
> - Dave

TESTED:
-------
[ fsfs | bdb4.4 ] x [ file | svn | http ]

PLATFORM:
---------
Windows XP Pro Version 2002 SP2 x86
MS Visual C++ 6.0

VARIANCES FROM 1.4.0 RC1:
-------------------------
Did not use bundled Neon, used Neon 0.24.7 instead. The bundled Neon
caused the following build failure:

  ne_xml.c
  src\ne_xml.c(50) : error C2018: unknown character '0x40'
  src\ne_xml.c(50) : error C2018: unknown character '0x40'
  src\ne_xml.c(51) : error C2018: unknown character '0x40'
  src\ne_xml.c(51) : error C2018: unknown character '0x40'
  src\ne_xml.c(52) : error C2018: unknown character '0x40'
  src\ne_xml.c(52) : error C2018: unknown character '0x40'
  ne_xmlreq.c
  ne_acl.c
  ne_props.c
  Generating Code...
  src\ne_sspi.c(448) : warning C4715: 'ne_sspi_clear_context' : not all
control paths return a value
  src\ne_socket.c(1014) : warning C4761: integral size mismatch in
argument; conversion supplied
  Compiling...
  ne_locks.c
  ne_openssl.c
  Generating Code...
  NMAKE : fatal error U1077: 'cl.exe' : return code '0x2'
  Stop.
  Error executing nmake.

This appears to be the same problem described here:
http://svn.haxx.se/dev/archive-2006-06/0264.shtml

RESULTS:
--------
All tests pass.

SIGNATURE:
----------
User: Paul T. Burba (pburba) <paulb@softlanding.com>
1024-bit DSA key, ID 53FCDC55, created 2006/06/21

subversion-1.4.0-rc1.zip.asc:
-----BEGIN PGP SIGNATURE-----
Version: GnuPG v1.4.3 (MingW32)

iD8DBQBEmaGM2RaJMFP83FURAjUdAJ9MZYB40jQLptNNdc9krjSajfHp0wCaAlS+
VN/AVqmCO+i6OMCpxKFoAF8=
=U9y4
-----END PGP SIGNATURE-----

---------------------------------------------------------------------
To unsubscribe, e-mail: dev-unsubscribe@subversion.tigris.org
For additional commands, e-mail: dev-help@subversion.tigris.org
Received on Wed Jun 21 22:47:51 2006

This is an archived mail posted to the Subversion Dev mailing list.