[svn.haxx.se] · SVN Dev · SVN Users · SVN Org · TSVN Dev · TSVN Users · Subclipse Dev · Subclipse Users · this month's index

Re: svn trunk r15032: FAIL (i686-pc-linux-gnu static ra_local fsfs)

From: David James <james82_at_gmail.com>
Date: 2005-06-12 03:47:57 CEST

These test failures were just caused by a lack of disk space, which
cut in just as I enabled the automated test script -- I'll see if I
can find a disk with more space :)

On 6/11/05, David James <james82@gmail.com> wrote:
> [snip]
> Running all tests in basic_tests.py...success
> Running all tests in commit_tests.py...success
> Running all tests in update_tests.py...FAILURE
> Running all tests in switch_tests.py...Traceback (most recent call last):
> File "/tmp/subversion-tester/svn/build/run_tests.py", line 192, in ?
> main()
> File "/tmp/subversion-tester/svn/build/run_tests.py", line 185, in main
> failed = th.run(args[2:])
> File "/tmp/subversion-tester/svn/build/run_tests.py", line 40, in run
> failed = self._run_test(prog) or failed
> File "/tmp/subversion-tester/svn/build/run_tests.py", line 107, in _run_test
> os.chdir(progdir)
> OSError: [Errno 2] No such file or directory: 'subversion/tests/clients/cmdline'
> make: *** [check] Error 1

-- 
David James -- http://www.cs.toronto.edu/~james
---------------------------------------------------------------------
To unsubscribe, e-mail: dev-unsubscribe@subversion.tigris.org
For additional commands, e-mail: dev-help@subversion.tigris.org
Received on Sun Jun 12 03:49:00 2005

This is an archived mail posted to the Subversion Dev mailing list.