[svn.haxx.se] · SVN Dev · SVN Users · SVN Org · TSVN Dev · TSVN Users · Subclipse Dev · Subclipse Users · this month's index

Re: svn trunk r15001: PASS (win32 ra_local bdb)

From: Erik Huelsmann <ehuels_at_gmail.com>
Date: 2005-06-07 23:55:38 CEST

I've got these marked to address this weekend: it shouldn't be PASS...

On 07/05/05 11:29:22, VFP <carl@personnelware.com> wrote:
> Last 100 lines of the build log (full log attached):
>
> Running all tests in hashdump-test.exe...success
> Running all tests in locks-test.exe...success
> Running all tests in opt-test.exe...success
> Running all tests in path-test.exe...success
> Running all tests in ra-local-test.exe...success
> Running all tests in random-test.exe...success
> Running all tests in repos-test.exe...success
> Running all tests in stream-test.exe...success
> Running all tests in string-test.exe...success
> Running all tests in time-test.exe...success
> Running all tests in translate-test.exe...success
> Running all tests in utf-test.exe...success
> Running all tests in changes-test.exe...success
> Running all tests in fs-test.exe...success
> Running all tests in key-test.exe...success
> Running all tests in skel-test.exe...success
> Running all tests in strings-reps-test.exe...success
> Running all tests in target-test.py...success
> Running all tests in getopt_tests.py...success
> Running all tests in basic_tests.py...success
> Running all tests in commit_tests.py...FAILURE
> Running all tests in update_tests.py...success
> Running all tests in switch_tests.py...success
> Running all tests in prop_tests.py...success
> Running all tests in schedule_tests.py...success
> Running all tests in log_tests.py...FAILURE
> Running all tests in copy_tests.py...success
> Running all tests in diff_tests.py...success
> Running all tests in export_tests.py...success
> Running all tests in externals_tests.py...success
> Running all tests in merge_tests.py...success
> Running all tests in revert_tests.py...success
> Running all tests in stat_tests.py...success
> Running all tests in trans_tests.py...success
> Running all tests in autoprop_tests.py...success
> Running all tests in blame_tests.py...success
> Running all tests in special_tests.py...success
> Running all tests in svnadmin_tests.py...success
> Running all tests in svnlook_tests.py...success
> Running all tests in svnversion_tests.py...success
> Running all tests in utf8_tests.py...success
> Running all tests in history_tests.py...success
> Running all tests in lock_tests.py...success
> Running all tests in cat_tests.py...success
> Running all tests in import_tests.py...success
> At least one test FAILED, checking c:\tests-local\tests.log
> FAIL: commit_tests.py 22: commit from a dir with a longer name than the wc
> FAIL: log_tests.py 1: 'svn log', no args, top of wc
> FAIL: log_tests.py 6: 'svn log', with args, top of wc
> FAIL: log_tests.py 8: 'svn log TGT' with copyfrom history
> At least one test was SKIPPED, checking c:\tests-local\tests.log
> SKIP: ra-local-test.exe 4: svn_ra_local__split_URL: invalid host names
> SKIP: commit_tests.py 32: tabs in paths
> SKIP: schedule_tests.py 4: schedule: add some executable files
> SKIP: schedule_tests.py 10: revert: add some executable files
> SKIP: schedule_tests.py 16: commit: add some executable files
> SKIP: copy_tests.py 11: executable bit should be preserved when copying
> SKIP: stat_tests.py 6: status on versioned items replaced by symlinks
> SKIP: special_tests.py 1: general symlink handling
> SKIP: special_tests.py 2: replace a normal file with a special file
> SKIP: special_tests.py 3: import and export a symlink
> SKIP: special_tests.py 4: 'svn cp dir1 dir2' which contains a symlink
> SKIP: special_tests.py 5: replace a special file with a non-special file
> SKIP: special_tests.py 6: remove a symlink
> SKIP: utf8_tests.py 1: conversion of paths and logs to/from utf8
> SKIP: lock_tests.py 25: svn:needs-lock and svn:executable, part I
> SKIP: lock_tests.py 26: svn:needs-lock and svn:executable, part II
> SKIP: import_tests.py 1: import of executable files
> kill: c:\tests-local\subversion\clients\cmdline\svn.exe
> kill: c:\tests-local\subversion\svnadmin\svnadmin.exe
> kill: c:\tests-local\subversion\svndumpfilter\svndumpfilter.exe
> kill: c:\tests-local\subversion\svnlook\svnlook.exe
> kill: c:\tests-local\subversion\svnserve\svnserve.exe
> kill: c:\tests-local\subversion\svnversion\svnversion.exe
> kill: c:\tests-local\subversion\tests\libsvn_delta\random-test.exe
> kill: c:\tests-local\subversion\tests\libsvn_delta\svndiff-test.exe
> kill: c:\tests-local\subversion\tests\libsvn_delta\vdelta-test.exe
> kill: c:\tests-local\subversion\tests\libsvn_diff\diff-diff3-test.exe
> kill: c:\tests-local\subversion\tests\libsvn_fs\locks-test.exe
> kill: c:\tests-local\subversion\tests\libsvn_fs_base\changes-test.exe
> kill: c:\tests-local\subversion\tests\libsvn_fs_base\fs-test.exe
> kill: c:\tests-local\subversion\tests\libsvn_fs_base\key-test.exe
> kill: c:\tests-local\subversion\tests\libsvn_fs_base\skel-test.exe
> kill: c:\tests-local\subversion\tests\libsvn_fs_base\strings-reps-test.exe
> kill: c:\tests-local\subversion\tests\libsvn_ra_local\ra-local-test.exe
> kill: c:\tests-local\subversion\tests\libsvn_repos\repos-test.exe
> kill: c:\tests-local\subversion\tests\libsvn_subr\compat-test.exe
> kill: c:\tests-local\subversion\tests\libsvn_subr\config-test.exe
> kill: c:\tests-local\subversion\tests\libsvn_subr\hashdump-test.exe
> kill: c:\tests-local\subversion\tests\libsvn_subr\opt-test.exe
> kill: c:\tests-local\subversion\tests\libsvn_subr\path-test.exe
> kill: c:\tests-local\subversion\tests\libsvn_subr\stream-test.exe
> kill: c:\tests-local\subversion\tests\libsvn_subr\string-test.exe
> kill: c:\tests-local\subversion\tests\libsvn_subr\target-test.exe
> kill: c:\tests-local\subversion\tests\libsvn_subr\time-test.exe
> kill: c:\tests-local\subversion\tests\libsvn_subr\utf-test.exe
> kill: c:\tests-local\subversion\tests\libsvn_wc\translate-test.exe
>
> *** Whoops, something choked.
>
>
>
>

---------------------------------------------------------------------
To unsubscribe, e-mail: dev-unsubscribe@subversion.tigris.org
For additional commands, e-mail: dev-help@subversion.tigris.org
Received on Tue Jun 7 23:57:06 2005

This is an archived mail posted to the Subversion Dev mailing list.