[svn.haxx.se] · SVN Dev · SVN Users · SVN Org · TSVN Dev · TSVN Users · Subclipse Dev · Subclipse Users · this month's index

Re: Problems with 0.31.0

From: David Summers <david_at_summersoft.fay.ar.us>
Date: 2003-10-08 05:11:44 CEST

On Tue, 7 Oct 2003 pll@lanminds.com wrote:

> In a message dated: Tue, 07 Oct 2003 17:08:54 CDT
> David Summers said:
> >I was rushing to get subversion-0.31.0-7347 RPM build to make sure it
> >would work with all the last minute changes and it built fine (after
> >upgrading to neon-0.24.3).
> >
> >However, now when I try to update the subversion working copy I get:
> >
> >[david@amd subversion]$ svn update
> >svn: RA layer request failed
> >svn: PROPFIND request failed on '/repos/svn/branches/release-0.31.0'
> >svn: The PROPFIND request returned invalid XML in the response: Unknown
> >error. (/repos/svn/branches/release-0.31.0)
> >
> >I erased the .subversion directory and re-tried with the same error.
> >
> >Have I missed something or am I doing something silly or ...... ?????????
> can you do an:
> svn ls -r7345 http://svn.collab.net/repos/svn/branches/release-0.31.0
> ?

Nope, I get the same error.

> It might just be congestion on that server. I find that every now
> and then just repeating the command usually works.
> Btw, I'm using r7348 to create the tar-ball.

Ok, I'll back down to 0.30 and use it to get 7348 and try that, however I
really don't think that's the problem because in the mean-time, I ran the
regression tests and a whole bunch failed on RA_DAV:

Running all tests in basic_tests.py...FAILURE
Running all tests in commit_tests.py...FAILURE
Running all tests in update_tests.py...FAILURE
Running all tests in switch_tests.py...FAILURE
Running all tests in prop_tests.py...FAILURE
Running all tests in schedule_tests.py...FAILURE
Running all tests in log_tests.py...FAILURE
Running all tests in copy_tests.py...FAILURE
Running all tests in diff_tests.py...FAILURE
Running all tests in export_tests.py...FAILURE
Running all tests in externals_tests.py...FAILURE
Running all tests in merge_tests.py...FAILURE
Running all tests in stat_tests.py...FAILURE
Running all tests in trans_tests.py...FAILURE
Running all tests in autoprop_tests.py...FAILURE
Running all tests in svnadmin_tests.py...FAILURE
Running all tests in svnlook_tests.py...FAILURE
Running all tests in svnversion_tests.py...FAILURE
At least one test FAILED, checking
FAIL: basic_tests.py 1: basic checkout of a wc
FAIL: commit_tests.py 1: commit one file
FAIL: update_tests.py 1: update a locally-modified binary file
FAIL: switch_tests.py 1: test some basic switching operations
FAIL: prop_tests.py 1: write/read props in wc only (ps, pl, pdel)
FAIL: schedule_tests.py 1: schedule: add some files
FAIL: log_tests.py 1: 'svn log', no args, top of wc
FAIL: copy_tests.py 1: basic copy and move commands -- on files only
FAIL: diff_tests.py 1: update a file
FAIL: export_tests.py 1: export an empty directory
FAIL: externals_tests.py 1: test checkouts with externals
FAIL: merge_tests.py 1: performing a merge, with mixed results
FAIL: stat_tests.py 1: status on unversioned file in current directory
FAIL: trans_tests.py 1: commit new files with keywords active from birth
FAIL: autoprop_tests.py 1: add: config=no, commandline=none
FAIL: svnadmin_tests.py 1: 'svnadmin dump' on copied directory
FAIL: svnlook_tests.py 1: test 'svnlook youngest' subcommand
FAIL: svnversion_tests.py 1: test 'svnversion' on wc and other dirs
make[1]: *** [check] Error 1
make[1]: Leaving directory `/home/david/rpms/build/subversion-0.31.0'
error: Bad exit status from /home/david/rpms/tmp/rpm-tmp.70779 (%build)

I hadn't run them before a while ago because I was just checking that the
new neon-0.24.3 and changes in subversion would compile.

David Wayne Summers          "Linux: Because reboots are for hardware upgrades!"
david_at_summersoft.fay.ar.us   PGP Key: http://summersoft.fay.ar.us/~david/pgp.txt
PGP Key fingerprint =  C0 E0 4F 50 DD A9 B6 2B  60 A1 31 7E D2 28 6D A8 
To unsubscribe, e-mail: dev-unsubscribe@subversion.tigris.org
For additional commands, e-mail: dev-help@subversion.tigris.org
Received on Wed Oct 8 05:20:57 2003

This is an archived mail posted to the Subversion Dev mailing list.

This site is subject to the Apache Privacy Policy and the Apache Public Forum Archive Policy.