[svn.haxx.se] · SVN Dev · SVN Users · SVN Org · TSVN Dev · TSVN Users · Subclipse Dev · Subclipse Users · this month's index

Re: Upcoming 0.25 Release - make errors

From: Ben Collins-Sussman <sussman_at_collab.net>
Date: 2003-07-07 18:27:17 CEST

pll@lanminds.com writes:

> In file included from subversion/libsvn_ra_dav/commit.c:49:
> subversion/libsvn_ra_dav/ra_dav.h:423: error: parse error before "ne_xml_validate_cb"
> subversion/libsvn_ra_dav/ra_dav.h:429: warning: `struct ne_xml_elm' declared inside parameter list
> subversion/libsvn_ra_dav/ra_dav.h:429: warning: its scope is only this definition or declaration, which is probably not what you want
> subversion/libsvn_ra_dav/ra_dav.h:429: warning: function declaration isn't a prototype
> subversion/libsvn_ra_dav/ra_dav.h:435: error: `NE_ELM_207_UNUSED' undeclared here (not in a function)
> subversion/libsvn_ra_dav/ra_dav.h:435: error: enumerator value for `ELEM_activity_coll_set' not integer constant
> make: *** [subversion/libsvn_ra_dav/commit.lo] Error 1

Um, is this with neon-0.23.9 unpacked into your source tree?

To unsubscribe, e-mail: dev-unsubscribe@subversion.tigris.org
For additional commands, e-mail: dev-help@subversion.tigris.org
Received on Mon Jul 7 18:29:17 2003

This is an archived mail posted to the Subversion Dev mailing list.

This site is subject to the Apache Privacy Policy and the Apache Public Forum Archive Policy.