[svn.haxx.se] · SVN Dev · SVN Users · SVN Org · TSVN Dev · TSVN Users · Subclipse Dev · Subclipse Users · this month's index

Tru64 check failures

From: Joe Orton <jorton_at_btconnect.com>
Date: 2001-06-27 03:32:35 CEST

FWIW here's the 'make check' output on Tru64 5.0:

Running all sub-tests in stringtest...SUCCESS

Running all sub-tests in hashdump-test...SUCCESS

Running all sub-tests in path-test...SUCCESS

Running all sub-tests in random-test...SUCCESS

Running all sub-tests in svn-test.sh...FAILED
--- at least one sub-test FAILED, check tests.log.

Running all sub-tests in svn-test2.sh...SUCCESS

Running all sub-tests in target-test.sh...SUCCESS

Running all sub-tests in run-fs-tests.sh...SUCCESS

Running all sub-tests in run-repos-tests.sh...FAILED
--- at least one sub-test FAILED, check tests.log.

and tests.log is attached.

Regards,

joe

---------------------------------------------------------------------
To unsubscribe, e-mail: dev-unsubscribe@subversion.tigris.org
For additional commands, e-mail: dev-help@subversion.tigris.org

Received on Sat Oct 21 14:36:32 2006

This is an archived mail posted to the Subversion Dev mailing list.