[svn.haxx.se] · SVN Dev · SVN Users · SVN Org · TSVN Dev · TSVN Users · Subclipse Dev · Subclipse Users · this month's index

Another Broken build (or still broken)?

From: Kevin Pilch-Bisson <kevin_at_pilch-bisson.net>
Date: 2001-04-18 17:49:15 CEST

Running make -k (the second time), gives the output below. It seems
that the joining of the test libs requires more FS_LIBS magic. Anyone
have any ideas.

All other directories are fine.

-- 
~~~~~~~~~~~~~~~~~~~~~~~~~~~~~~~~~~~~~~~~~~~~~~~~~~~~~~~~~~~~~~~~~
Kevin Pilch-Bisson                    http://www.pilch-bisson.net
     "Historically speaking, the presences of wheels in Unix
     has never precluded their reinvention." - Larry Wall
~~~~~~~~~~~~~~~~~~~~~~~~~~~~~~~~~~~~~~~~~~~~~~~~~~~~~~~~~~~~~~~~~
Making all in .
make[1]: Entering directory `/home/kevin/projects/svn-build/subversion/tests'
make[1]: Nothing to be done for `all-am'.
make[1]: Leaving directory `/home/kevin/projects/svn-build/subversion/tests'
Making all in libsvn_subr
make[1]: Entering directory `/home/kevin/projects/svn-build/subversion/tests/libsvn_subr'
/bin/sh ../../../libtool --silent --mode=link gcc  -g -Wall -pipe -pthread -Wmissing-prototypes -Wstrict-prototypes -Wmissing-declarations -Wpointer-arith -Wwrite-strings -Wshadow -DSVN_DEBUG -DAP_DEBUG -g -Wall   -o hashdump-test  hashdump-test.o ../../../subversion/tests/libsvn_test.la                       ../../../subversion/libsvn_delta/libsvn_delta.la                       ../../../subversion/libsvn_subr/libsvn_subr.la                       ../../../apr/libapr.la  /home/kevin/projects/svn-build/apr/shmem/unix/mm/libmm.la ../../../expat-lite/libexpat.la -lm -lcrypt -lnsl  -ldl -L/usr/local/BerkeleyDB.3.2/lib -ldb
../../../subversion/tests/.libs/libsvn_test.so: undefined reference to `svn_fs_dir_entries'
../../../subversion/tests/.libs/libsvn_test.so: undefined reference to `svn_fs_make_dir'
../../../subversion/tests/.libs/libsvn_test.so: undefined reference to `svn_fs_set_berkeley_errcall'
../../../subversion/tests/.libs/libsvn_test.so: undefined reference to `svn_fs_file_contents'
../../../subversion/tests/.libs/libsvn_test.so: undefined reference to `svn_fs_make_file'
../../../subversion/tests/.libs/libsvn_test.so: undefined reference to `svn_fs_set_warning_func'
../../../subversion/tests/.libs/libsvn_test.so: undefined reference to `svn_fs_apply_textdelta'
../../../subversion/tests/.libs/libsvn_test.so: undefined reference to `svn_fs_is_dir'
../../../subversion/tests/.libs/libsvn_test.so: undefined reference to `svn_fs_create_berkeley'
../../../subversion/tests/.libs/libsvn_test.so: undefined reference to `svn_fs_delete_berkeley'
../../../subversion/tests/.libs/libsvn_test.so: undefined reference to `svn_fs_delete_tree'
../../../subversion/tests/.libs/libsvn_test.so: undefined reference to `svn_fs_new'
collect2: ld returned 1 exit status
make[1]: *** [hashdump-test] Error 1
/bin/sh ../../../libtool --silent --mode=link gcc  -g -Wall -pipe -pthread -Wmissing-prototypes -Wstrict-prototypes -Wmissing-declarations -Wpointer-arith -Wwrite-strings -Wshadow -DSVN_DEBUG -DAP_DEBUG -g -Wall   -o stringtest  stringtest.o ../../../subversion/tests/libsvn_test.la                    ../../../subversion/libsvn_delta/libsvn_delta.la                    ../../../subversion/libsvn_subr/libsvn_subr.la                    ../../../apr/libapr.la  /home/kevin/projects/svn-build/apr/shmem/unix/mm/libmm.la ../../../expat-lite/libexpat.la -lm -lcrypt -lnsl  -ldl -L/usr/local/BerkeleyDB.3.2/lib -ldb
../../../subversion/tests/.libs/libsvn_test.so: undefined reference to `svn_fs_dir_entries'
../../../subversion/tests/.libs/libsvn_test.so: undefined reference to `svn_fs_make_dir'
../../../subversion/tests/.libs/libsvn_test.so: undefined reference to `svn_fs_set_berkeley_errcall'
../../../subversion/tests/.libs/libsvn_test.so: undefined reference to `svn_fs_file_contents'
../../../subversion/tests/.libs/libsvn_test.so: undefined reference to `svn_fs_make_file'
../../../subversion/tests/.libs/libsvn_test.so: undefined reference to `svn_fs_set_warning_func'
../../../subversion/tests/.libs/libsvn_test.so: undefined reference to `svn_fs_apply_textdelta'
../../../subversion/tests/.libs/libsvn_test.so: undefined reference to `svn_fs_is_dir'
../../../subversion/tests/.libs/libsvn_test.so: undefined reference to `svn_fs_create_berkeley'
../../../subversion/tests/.libs/libsvn_test.so: undefined reference to `svn_fs_delete_berkeley'
../../../subversion/tests/.libs/libsvn_test.so: undefined reference to `svn_fs_delete_tree'
../../../subversion/tests/.libs/libsvn_test.so: undefined reference to `svn_fs_new'
collect2: ld returned 1 exit status
make[1]: *** [stringtest] Error 1
make[1]: Target `all' not remade because of errors.
make[1]: Leaving directory `/home/kevin/projects/svn-build/subversion/tests/libsvn_subr'
Making all in libsvn_delta
make[1]: Entering directory `/home/kevin/projects/svn-build/subversion/tests/libsvn_delta'
/bin/sh ../../../libtool --silent --mode=link gcc  -g -Wall -pipe -pthread -Wmissing-prototypes -Wstrict-prototypes -Wmissing-declarations -Wpointer-arith -Wwrite-strings -Wshadow -DSVN_DEBUG -DAP_DEBUG -g -Wall   -o deltaparse-test  deltaparse-test.o ../../../subversion/tests/libsvn_test.la ../../../subversion/libsvn_delta/libsvn_delta.la                         ../../../subversion/libsvn_subr/libsvn_subr.la ../../../apr/libapr.la  /home/kevin/projects/svn-build/apr/shmem/unix/mm/libmm.la ../../../expat-lite/libexpat.la -lm -lcrypt -lnsl  -ldl -L/usr/local/BerkeleyDB.3.2/lib -ldb
../../../subversion/tests/.libs/libsvn_test.so: undefined reference to `svn_fs_dir_entries'
../../../subversion/tests/.libs/libsvn_test.so: undefined reference to `svn_fs_make_dir'
../../../subversion/tests/.libs/libsvn_test.so: undefined reference to `svn_fs_set_berkeley_errcall'
../../../subversion/tests/.libs/libsvn_test.so: undefined reference to `svn_fs_file_contents'
../../../subversion/tests/.libs/libsvn_test.so: undefined reference to `svn_fs_make_file'
../../../subversion/tests/.libs/libsvn_test.so: undefined reference to `svn_fs_set_warning_func'
../../../subversion/tests/.libs/libsvn_test.so: undefined reference to `svn_fs_apply_textdelta'
../../../subversion/tests/.libs/libsvn_test.so: undefined reference to `svn_fs_is_dir'
../../../subversion/tests/.libs/libsvn_test.so: undefined reference to `svn_fs_create_berkeley'
../../../subversion/tests/.libs/libsvn_test.so: undefined reference to `svn_fs_delete_berkeley'
../../../subversion/tests/.libs/libsvn_test.so: undefined reference to `test_funcs'
../../../subversion/tests/.libs/libsvn_test.so: undefined reference to `svn_fs_delete_tree'
../../../subversion/tests/.libs/libsvn_test.so: undefined reference to `svn_fs_new'
collect2: ld returned 1 exit status
make[1]: *** [deltaparse-test] Error 1
make[1]: Target `all' not remade because of errors.
make[1]: Leaving directory `/home/kevin/projects/svn-build/subversion/tests/libsvn_delta'
Making all in libsvn_wc
make[1]: Entering directory `/home/kevin/projects/svn-build/subversion/tests/libsvn_wc'
/bin/sh ../../../libtool --silent --mode=link gcc  -g -Wall -pipe -pthread -Wmissing-prototypes -Wstrict-prototypes -Wmissing-declarations -Wpointer-arith -Wwrite-strings -Wshadow -DSVN_DEBUG -DAP_DEBUG -g -Wall   -o commit-test  commit-test.o ../../../subversion/tests/libsvn_test.la ../../../subversion/libsvn_wc/libsvn_wc.la                     ../../../subversion/libsvn_delta/libsvn_delta.la ../../../subversion/libsvn_subr/libsvn_subr.la                     ../../../apr/libapr.la  /home/kevin/projects/svn-build/apr/shmem/unix/mm/libmm.la ../../../expat-lite/libexpat.la -lm -lcrypt -lnsl  -ldl -L/usr/local/BerkeleyDB.3.2/lib -ldb
../../../subversion/tests/.libs/libsvn_test.so: undefined reference to `svn_fs_dir_entries'
../../../subversion/tests/.libs/libsvn_test.so: undefined reference to `svn_fs_make_dir'
../../../subversion/tests/.libs/libsvn_test.so: undefined reference to `svn_fs_set_berkeley_errcall'
../../../subversion/tests/.libs/libsvn_test.so: undefined reference to `svn_fs_file_contents'
../../../subversion/tests/.libs/libsvn_test.so: undefined reference to `svn_fs_make_file'
../../../subversion/tests/.libs/libsvn_test.so: undefined reference to `svn_fs_set_warning_func'
../../../subversion/tests/.libs/libsvn_test.so: undefined reference to `svn_fs_apply_textdelta'
../../../subversion/tests/.libs/libsvn_test.so: undefined reference to `svn_fs_is_dir'
../../../subversion/tests/.libs/libsvn_test.so: undefined reference to `svn_fs_create_berkeley'
../../../subversion/tests/.libs/libsvn_test.so: undefined reference to `svn_fs_delete_berkeley'
../../../subversion/tests/.libs/libsvn_test.so: undefined reference to `test_funcs'
../../../subversion/tests/.libs/libsvn_test.so: undefined reference to `svn_fs_delete_tree'
../../../subversion/tests/.libs/libsvn_test.so: undefined reference to `svn_fs_new'
collect2: ld returned 1 exit status
make[1]: *** [commit-test] Error 1
make[1]: Target `all' not remade because of errors.
make[1]: Leaving directory `/home/kevin/projects/svn-build/subversion/tests/libsvn_wc'
Making all in libsvn_fs
make[1]: Entering directory `/home/kevin/projects/svn-build/subversion/tests/libsvn_fs'
make[1]: Nothing to be done for `all'.
make[1]: Leaving directory `/home/kevin/projects/svn-build/subversion/tests/libsvn_fs'
Making all in libsvn_repos
make[1]: Entering directory `/home/kevin/projects/svn-build/subversion/tests/libsvn_repos'
make[1]: Nothing to be done for `all'.
make[1]: Leaving directory `/home/kevin/projects/svn-build/subversion/tests/libsvn_repos'
Making all in libsvn_ra_local
make[1]: Entering directory `/home/kevin/projects/svn-build/subversion/tests/libsvn_ra_local'
make[1]: Nothing to be done for `all'.
make[1]: Leaving directory `/home/kevin/projects/svn-build/subversion/tests/libsvn_ra_local'
make: *** [all-recursive] Error 1
make: Target `all' not remade because of errors.

  • application/pgp-signature attachment: stored
Received on Sat Oct 21 14:36:28 2006

This is an archived mail posted to the Subversion Dev mailing list.