[svn.haxx.se] · SVN Dev · SVN Users · SVN Org · TSVN Dev · TSVN Users · Subclipse Dev · Subclipse Users · this month's index

Re: Subversion RPM's for Fedora Core 1

From: David Summers <david_at_summersoft.fay.ar.us>
Date: 2004-06-04 02:30:03 CEST

On Thu, 3 Jun 2004, Chris Webster wrote:

> ok, on second attempt I got a different set of test failures!
>
> Running all tests in commit_tests.py...success
> Running all tests in update_tests.py...FAILURE
> Running all tests in switch_tests.py...success
> Running all tests in prop_tests.py...FAILURE
> Running all tests in schedule_tests.py...FAILURE
> Running all tests in log_tests.py...success
> Running all tests in copy_tests.py...FAILURE
> Running all tests in diff_tests.py...success
>
> [.....]
>
> At least one test FAILED, checking
> /h/9/cjw/rpms/build/subversion-1.0.4/tests.log
> FAIL: update_tests.py 1: update a locally-modified binary file
> FAIL: update_tests.py 17: non-recursive update
> FAIL: prop_tests.py 8: props work when reverting a replacement
> FAIL: prop_tests.py 10: file copies inherit (not re-derive) special props
> FAIL: prop_tests.py 11: set and get a revprop change
> FAIL: prop_tests.py 12: some svn: properties should be converted
> FAIL: prop_tests.py 13: test binary property support
> FAIL: prop_tests.py 14: recursive property operations in BASE and WC
> FAIL: schedule_tests.py 2: schedule: add some directories
> FAIL: schedule_tests.py 5: schedule: delete some files
> FAIL: schedule_tests.py 6: schedule: delete some directories
> FAIL: schedule_tests.py 8: revert: add some directories
> FAIL: schedule_tests.py 9: revert: add some nested files and directories
> FAIL: schedule_tests.py 12: revert: delete some directories
> FAIL: schedule_tests.py 19: unschedule addition on missing items
> FAIL: copy_tests.py 8: copy files with properties
> make[1]: *** [check] Error 1
> make[1]: Leaving directory `/h/9/cjw/rpms/build/subversion-1.0.4'
> error: Bad exit status from /h/9/cjw/rpms/tmp/rpm-tmp.65071 (%build)
>
>
> RPM build errors:
> Bad exit status from /h/9/cjw/rpms/tmp/rpm-tmp.65071 (%build)
> gmake: *** [build_rpm_files] Error 1
>

Now *that* is really wierd. Are you having any other strange problems on
that box? Normally computers are consistent. When they are not, then
something strange is usually going on.

-- 
David Wayne Summers          "Linux: Because reboots are for hardware upgrades!"
david_at_summersoft.fay.ar.us   PGP Key: http://summersoft.fay.ar.us/~david/pgp.txt
PGP Key fingerprint =  C0 E0 4F 50 DD A9 B6 2B  60 A1 31 7E D2 28 6D A8 
---------------------------------------------------------------------
To unsubscribe, e-mail: users-unsubscribe@subversion.tigris.org
For additional commands, e-mail: users-help@subversion.tigris.org
Received on Fri Jun 4 02:31:21 2004

This is an archived mail posted to the Subversion Users mailing list.