[svn.haxx.se] · SVN Dev · SVN Users · SVN Org · TSVN Dev · TSVN Users · Subclipse Dev · Subclipse Users · this month's index

Re: Tortoise Build fails (wrong version)

From: Jean-Marc van Leerdam <j.m.van.leerdam_at_gmail.com>
Date: Mon, 25 Oct 2010 15:36:27 +0200

Did you notice the error message: working copy format too old. This seems to
indicate that you perfomed the checkout with another version than subwcrev
is expecting.

Op 25 okt 2010 15:28 schreef "Andreas Houben" <andreas.houben_at_googlemail.com
>:

Hi,

I'm trying to build tortoiseSVN, using the instructions given in build.txt.
I encountered a problem that you may want to add in the file. If
antivir-Software (in my case Microsoft Security Essentials), executing
vsvars32.bat has no effect. But that is not the main topic of my discussion.
If i try to build tortoise, I always get the following error:

TortoiseSVN:

     [nant]
C:\Users\Studienprojekt\Documents\Studienprojekt\SVN\TortoiseSVN\src\TortoiseSVN.build
TortoiseSVN
            Buildfile:
file:///C:/Users/Studienprojekt/Documents/Studienprojekt/SVN/TortoiseSVN/src/TortoiseSVN.build
            Target framework: Microsoft .NET Framework 2.0
            Target(s) specified: TortoiseSVN

            clean:

            versioninfo:

                 [copy] Copying 7 files to
'C:\Users\Studienprojekt\Documents\Studienprojekt\SVN\TortoiseSVN\bin\release\bin'.
                 [nant]
C:\Users\Studienprojekt\Documents\Studienprojekt\SVN\TortoiseSVN\versioninfo.build
versioninfo
                        Buildfile:
file:///C:/Users/Studienprojekt/Documents/Studienprojekt/SVN/TortoiseSVN/versioninfo.build
                        Target framework: Microsoft .NET Framework 2.0
                        Target(s) specified: versioninfo

                        versioninfo:

                             [exec] SubWCRev : Working copy format of
'C:\Users\Studienprojekt\Documents\Studienprojekt\SVN\TortoiseSVN' is too
old (10); please run 'svn upgrade'

                        BUILD FAILED

C:\Users\Studienprojekt\Documents\Studienprojekt\SVN\TortoiseSVN\versioninfo.build(38,8):
                        External Program Failed:
C:\Users\Studienprojekt\Documents\Studienprojekt\SVN\TortoiseSVN\bin\release\bin\SubWCRev.exe
(return code was 6)

                        Total time: 0.2 seconds.

            BUILD FAILED

            Nested build failed. Refer to build log for exact reason.

            Total time: 0.8 seconds.

BUILD FAILED

Nested build failed. Refer to build log for exact reason.

Total time: 196.6 seconds.

I don't know what to do. Before building I checked out the last Version of
the sourcecode.
I am running Windows 7, if that may be a concern.

Hope you may help me. I already searched for answers, but couldnt find any.
If I coincidentally started a topic, that is already covered, i may have
overlooked it and apologize for the extra question.

Greetings,

Andreas

------------------------------------------------------
http://tortoisesvn.tigris.org/ds/viewMessage.do?dsForumId=757&dsMessageId=2675348

To unsubscribe from this discussion, e-mail: [dev-unsubscribe_at_tortoisesvn.tigris.org].
Received on 2010-10-25 15:36:35 CEST

This is an archived mail posted to the TortoiseSVN Dev mailing list.