[svn.haxx.se] · SVN Dev · SVN Users · SVN Org · TSVN Dev · TSVN Users · Subclipse Dev · Subclipse Users · this month's index

Re: 1.7.1 up for testing / signing

From: rupert.thurner <rupert.thurner_at_gmail.com>
Date: Thu, 20 Oct 2011 16:19:08 -0700 (PDT)

on solaris, one test is failing for 1.7.0 ...
At least one test FAILED, checking /home/rupert/mgar-sav/pkg/
subversion/trunk/work/solaris9-sparc/build-isa-sparcv8/
subversion-1.7.0/tests.log
FAIL: copy_tests.py 86: changed dir after commit should match
checkout
Summary of test results:
  1552 tests PASSED
  42 tests SKIPPED
  23 tests XFAILED (1 WORK-IN-PROGRESS)
  1 test FAILED
gmake: *** [check] Error 1

On Oct 20, 10:04 pm, Mark Phippard <markp..._at_gmail.com> wrote:
> SUMMARY:
> +1 to release
>
> PLATFORM:
>  Windows 7
>  VS 2008 SP1
>  Java 1.6
>
> COMPONENTS:
>  Apache        2.2.19
>  APR             1.4.5
>  APR-UTIL    1.3.12
>  OpenSSL     1.0.0a
>  Neon            0.29.6
>  Serf             1.0.0
>  ZLib             1.2.4
>  SQLite         3.7.7.1
>
> VERIFIED:
>  signature and sha1
>
> TESTED:
>  JavaHL
>  ra_local | ra_svn | ra_neon | ra_serf X fsfs
>
> RESULTS:
>  All passed
>
> SIGNATURES:
>
> subversion-1.7.1.zip
> -----BEGIN PGP SIGNATURE-----
> Version: GnuPG v2.0.17 (MingW32)
>
> iEYEABECAAYFAk6gfMYACgkQJl34oANalqk63wCgsheZHHuXRFOQ4OoW5wbbAC8T
> u64AoJcuwEIlsV0o1huy2PxH8JL7ovVo
> =8Dll
> -----END PGP SIGNATURE-----
>
> --
> Thanks
>
> Mark Phippardhttp://markphip.blogspot.com/
Received on 2011-10-21 01:19:41 CEST

This is an archived mail posted to the Subversion Dev mailing list.